null
SMILES: CCC(=O)N1CC(C1)NC(=O)c1cnc(N)c2nc(ccc12)-c1cccc(F)c1
InChI Key: InChIKey=XDOJQLHPRVGYGJ-UHFFFAOYSA-N
Activity Spreadsheet -- Enzyme Inhibition Constant Data from BindingDB
Found 1 hit for monomerid = 50122740
Trg + Lig
Ki
nM
ΔG°
kcal/mole
IC50
nM
Kd
nM
EC50/IC50
nM
koff
s-1
kon
M-1s-1
pHTemp
°C
Mitogen-activated protein kinase kinase kinase kinase 4
(Homo sapiens (Human))
BDBM50122740
(CHEMBL3623137)
Show SMILES CCC(=O)N1CC(C1)NC(=O)c1cnc(N)c2nc(ccc12)-c1cccc(F)c1
Show InChI InChI=1S/C21H20FN5O2/c1-2-18(28)27-10-14(11-27)25-21(29)16-9-24-20(23)19-15(16)6-7-17(26-19)12-4-3-5-13(22)8-12/h3-9,14H,2,10-11H2,1H3,(H2,23,24)(H,25,29)
NCI pathway
Reactome pathway
n/an/a 3.5n/an/an/an/an/an/a
Genentech
Curated by ChEMBL
Assay Description
Inhibition of MAP4K4 (unknown origin) by Z'LYTE assay
ACS Med Chem Lett 6: 913-8 (2015)
BindingDB Entry DOI: 10.7270/Q2M32XJB