null
SMILES: CNC(=O)c1ccccc1OC1CCN(C1)C(=O)c1ccc(Br)s1
InChI Key: InChIKey=UEGKIINBMPDRFO-UHFFFAOYSA-N
Activity Spreadsheet -- Enzyme Inhibition Constant Data from BindingDB
Found 1 hit for monomerid = 50122744
Trg + Lig
Ki
nM
ΔG°
kcal/mole
IC50
nM
Kd
nM
EC50/IC50
nM
koff
s-1
kon
M-1s-1
pHTemp
°C
Branched-chain-amino-acid aminotransferase, mitochondrial
(Homo sapiens (Human))
BDBM50122744
(CHEMBL3623149)
Show SMILES CNC(=O)c1ccccc1OC1CCN(C1)C(=O)c1ccc(Br)s1
Show InChI InChI=1S/C17H17BrN2O3S/c1-19-16(21)12-4-2-3-5-13(12)23-11-8-9-20(10-11)17(22)14-6-7-15(18)24-14/h2-7,11H,8-10H2,1H3,(H,19,21)
n/an/a>1.00E+5n/an/an/an/an/an/a
GlaxoSmithKline
Curated by ChEMBL
Assay Description
Inhibition of human BCATm after 10 mins by fluorescent assay
ACS Med Chem Lett 6: 919-24 (2015)
BindingDB Entry DOI: 10.7270/Q2GB25T0