BDBM50122900 (5R,8S,11S,14S,17S,20S)-20-acetamido-14-benzhydryl-11,17-bis(2-carboxyethyl)-1-(2-chlorophenyl)-8-(cyclohexylmethyl)-5-(mercaptomethyl)-4,7,10,13,16,19-hexaoxo-3,6,9,12,15,18-hexaazadocosan-22-oic acid::4-(2-Acetylamino-3-carboxy-propionylamino)-4-(1-{1-[1-(1-{[2-(2-chloro-phenyl)-ethyl]-methyl-carbamoyl}-2-mercapto-ethylcarbamoyl)-2-cyclohexyl-ethylcarbamoyl]-3-methoxycarbonyl-propylcarbamoyl}-2,2-diphenyl-ethylcarbamoyl)-butyric acid::CHEMBL263172
SMILES: CC(=O)N[C@@H](CC(O)=O)C(=O)N[C@@H](CCC(O)=O)C(=O)N[C@@H](C(c1ccccc1)c1ccccc1)C(=O)N[C@@H](CCC(O)=O)C(=O)N[C@@H](CC1CCCCC1)C(=O)N[C@@H](CS)C(=O)NCCc1ccccc1Cl
InChI Key: InChIKey=ZEQISCWXSBUQIT-VUKWIJDPSA-N
Data: 1 IC50
Activity Spreadsheet -- Enzyme Inhibition Constant Data from BindingDB
Found 1 hit for monomerid = 50122900
Trg + Lig
Ki
nM
ΔG°
kcal/mole
IC50
nM
Kd
nM
EC50/IC50
nM
koff
s-1
kon
M-1s-1
pHTemp
°C
Hepatitis C virus serine protease, NS3/NS4A
(Hepatitis C virus)
BDBM50122900
((5R,8S,11S,14S,17S,20S)-20-acetamido-14-benzhydryl...)
Show SMILES CC(=O)N[C@@H](CC(O)=O)C(=O)N[C@@H](CCC(O)=O)C(=O)N[C@@H](C(c1ccccc1)c1ccccc1)C(=O)N[C@@H](CCC(O)=O)C(=O)N[C@@H](CC1CCCCC1)C(=O)N[C@@H](CS)C(=O)NCCc1ccccc1Cl |r|
Show InChI InChI=1S/C51H64ClN7O13S/c1-30(60)54-39(28-43(65)66)50(71)55-37(22-24-42(63)64)48(69)59-45(44(33-16-7-3-8-17-33)34-18-9-4-10-19-34)51(72)56-36(21-23-41(61)62)47(68)57-38(27-31-13-5-2-6-14-31)49(70)58-40(29-73)46(67)53-26-25-32-15-11-12-20-35(32)52/h3-4,7-12,15-20,31,36-40,44-45,73H,2,5-6,13-14,21-29H2,1H3,(H,53,67)(H,54,60)(H,55,71)(H,56,72)(H,57,68)(H,58,70)(H,59,69)(H,61,62)(H,63,64)(H,65,66)/t36-,37-,38-,39-,40-,45-/m0/s1
n/an/a 2n/an/an/an/an/an/a
MRL Rome
Curated by ChEMBL
Assay Description
Inhibitory activity against Hepatitis C NS3/NS4A protease
J Med Chem 46: 345-8 (2003)
Article DOI: 10.1021/jm025594q
BindingDB Entry DOI: 10.7270/Q2CF9PF1