null
SMILES: Fc1ccc(-c2nc3ccccn3c2C2=NN(C(=O)CC2)c2c(Cl)cccc2Cl)c(Cl)c1
InChI Key: InChIKey=HEYLBNKMXMMHAM-UHFFFAOYSA-N
Activity Spreadsheet -- Enzyme Inhibition Constant Data from BindingDB
Found 3 hits for monomerid = 50122911
Trg + Lig
Ki
nM
ΔG°
kcal/mole
IC50
nM
Kd
nM
EC50/IC50
nM
koff
s-1
kon
M-1s-1
pHTemp
°C
Mitogen-activated protein kinase 11/12/13/14
(Homo sapiens (Human))
BDBM50122911
(6-[2-(2-Chloro-4-fluoro-phenyl)-imidazo[1,2-a]pyri...)
Show SMILES Fc1ccc(-c2nc3ccccn3c2C2=NN(C(=O)CC2)c2c(Cl)cccc2Cl)c(Cl)c1 |t:16|
Show InChI InChI=1S/C23H14Cl3FN4O/c24-15-4-3-5-16(25)22(15)31-20(32)10-9-18(29-31)23-21(14-8-7-13(27)12-17(14)26)28-19-6-1-2-11-30(19)23/h1-8,11-12H,9-10H2
n/an/a 180n/an/an/an/an/an/a
Merck Research Laboratories
Curated by ChEMBL
Assay Description
Inhibition of Tumor necrosis factor alpha release from LPS-induced THP-1 cells by ELISA
J Med Chem 46: 349-52 (2003)
Article DOI: 10.1021/jm025585h
BindingDB Entry DOI: 10.7270/Q27P8XRR
Mitogen-activated protein kinase 14
(Mus musculus (mouse))
BDBM50122911
(6-[2-(2-Chloro-4-fluoro-phenyl)-imidazo[1,2-a]pyri...)
Show SMILES Fc1ccc(-c2nc3ccccn3c2C2=NN(C(=O)CC2)c2c(Cl)cccc2Cl)c(Cl)c1 |t:16|
Show InChI InChI=1S/C23H14Cl3FN4O/c24-15-4-3-5-16(25)22(15)31-20(32)10-9-18(29-31)23-21(14-8-7-13(27)12-17(14)26)28-19-6-1-2-11-30(19)23/h1-8,11-12H,9-10H2
Reactome pathway
n/an/a 42n/an/an/an/an/an/a
Merck Research Laboratories
Curated by ChEMBL
Assay Description
Tested in vitro for filter plate binding versus gamma-[33P]ATP in active recombinant murine FLAG-P38 alpha fusion protein (GST-Activating transcripti...
J Med Chem 46: 349-52 (2003)
Article DOI: 10.1021/jm025585h
BindingDB Entry DOI: 10.7270/Q27P8XRR
Mitogen-activated protein kinase 11
(Mus musculus (mouse))
BDBM50122911
(6-[2-(2-Chloro-4-fluoro-phenyl)-imidazo[1,2-a]pyri...)
Show SMILES Fc1ccc(-c2nc3ccccn3c2C2=NN(C(=O)CC2)c2c(Cl)cccc2Cl)c(Cl)c1 |t:16|
Show InChI InChI=1S/C23H14Cl3FN4O/c24-15-4-3-5-16(25)22(15)31-20(32)10-9-18(29-31)23-21(14-8-7-13(27)12-17(14)26)28-19-6-1-2-11-30(19)23/h1-8,11-12H,9-10H2
Reactome pathway
n/an/a 670n/an/an/an/an/an/a
Merck Research Laboratories
Curated by ChEMBL
Assay Description
Displacement of [gamma-33P]-ATP binding from active recombinant murine FLAG-Mitogen-activated protein kinase p38 beta fusion protein (GST-ATF2)
J Med Chem 46: 349-52 (2003)
Article DOI: 10.1021/jm025585h
BindingDB Entry DOI: 10.7270/Q27P8XRR