null
SMILES: Cc1cccc(C)c1Cc1n[nH]c(=O)c2ccccc12
InChI Key: InChIKey=YXQVZANAZNYFNM-UHFFFAOYSA-N
Activity Spreadsheet -- Enzyme Inhibition Constant Data from BindingDB
Found 2 hits for monomerid = 50122962
Trg + Lig
Ki
nM
ΔG°
kcal/mole
IC50
nM
Kd
nM
EC50/IC50
nM
koff
s-1
kon
M-1s-1
pHTemp
°C
Androgen receptor
(Homo sapiens (Human))
BDBM50122962
(CHEMBL3622587)
Show SMILES Cc1cccc(C)c1Cc1n[nH]c(=O)c2ccccc12
Show InChI InChI=1S/C17H16N2O/c1-11-6-5-7-12(2)15(11)10-16-13-8-3-4-9-14(13)17(20)19-18-16/h3-9H,10H2,1-2H3,(H,19,20)
NCI pathway
Reactome pathway
n/an/a 8.43E+4n/an/an/an/an/an/a
Ochanomizu University
Curated by ChEMBL
Assay Description
Displacement of [3H]-DHT from human GST fused AR-LBD (627 to 919 amino acids) transfected in Escherichia coli HB 101 after 15 hrs by liquid scintilla...
Eur J Med Chem 102: 310-9 (2015)
BindingDB Entry DOI: 10.7270/Q2348N6H
Androgen receptor
(Homo sapiens (Human))
BDBM50122962
(CHEMBL3622587)
Show SMILES Cc1cccc(C)c1Cc1n[nH]c(=O)c2ccccc12
Show InChI InChI=1S/C17H16N2O/c1-11-6-5-7-12(2)15(11)10-16-13-8-3-4-9-14(13)17(20)19-18-16/h3-9H,10H2,1-2H3,(H,19,20)
NCI pathway
Reactome pathway
n/an/a 1.38E+3n/an/an/an/an/an/a
Ochanomizu University
Curated by ChEMBL
Assay Description
Antagonist activity at wild type AR expressed in human SC cells assessed as inhibition of 1 nM DHT-induced cell proliferation after 3 days by WST-8 a...
Eur J Med Chem 102: 310-9 (2015)
BindingDB Entry DOI: 10.7270/Q2348N6H