BDBM50123096 6,7-Dihydroxy-2-[1-(2-hydroxy-4-isobutoxy-phenyl)-meth-(E)-ylidene]-benzofuran-3-one::CHEMBL132701
SMILES: CC(C)COc1ccc(\C=C2\Oc3c(ccc(O)c3O)C2=O)c(O)c1
InChI Key: InChIKey=HSLKFZVADGJLJO-FRKPEAEDSA-N
Data: 1 IC50
Activity Spreadsheet -- Enzyme Inhibition Constant Data from BindingDB
Found 1 hit for monomerid = 50123096
Trg + Lig
Ki
nM
ΔG°
kcal/mole
IC50
nM
Kd
nM
EC50/IC50
nM
koff
s-1
kon
M-1s-1
pHTemp
°C
Chorismate synthase
(Streptococcus pneumoniae)
BDBM50123096
(6,7-Dihydroxy-2-[1-(2-hydroxy-4-isobutoxy-phenyl)-...)
Show SMILES CC(C)COc1ccc(\C=C2\Oc3c(ccc(O)c3O)C2=O)c(O)c1
Show InChI InChI=1S/C19H18O6/c1-10(2)9-24-12-4-3-11(15(21)8-12)7-16-17(22)13-5-6-14(20)18(23)19(13)25-16/h3-8,10,20-21,23H,9H2,1-2H3/b16-7+
n/an/a 580n/an/an/an/an/an/a
PanTherix Ltd.
Curated by ChEMBL
Assay Description
Inhibitory concentration against Streptococcus pneumoniae chorismate synthase
Bioorg Med Chem Lett 13: 423-6 (2003)
BindingDB Entry DOI: 10.7270/Q2TH8M2M