BDBM50123301 2-Allyl-8-methoxy-3-thioxo-2,3-dihydro-imidazo[1,5-a]indol-1-one::CHEMBL151328
SMILES: COc1cccc2n3C(=S)N(CC=C)C(=O)c3cc12
InChI Key: InChIKey=PGQOJKIOLXIQAN-UHFFFAOYSA-N
Data: 1 IC50
Activity Spreadsheet -- Enzyme Inhibition Constant Data from BindingDB
Found 1 hit for monomerid = 50123301
Trg + Lig
Ki
nM
ΔG°
kcal/mole
IC50
nM
Kd
nM
EC50/IC50
nM
koff
s-1
kon
M-1s-1
pHTemp
°C
Tumor necrosis factor receptor R1
(Homo sapiens (Human))
BDBM50123301
(2-Allyl-8-methoxy-3-thioxo-2,3-dihydro-imidazo[1,5...)
Show SMILES COc1cccc2n3C(=S)N(CC=C)C(=O)c3cc12
Show InChI InChI=1S/C14H12N2O2S/c1-3-7-15-13(17)11-8-9-10(16(11)14(15)19)5-4-6-12(9)18-2/h3-6,8H,1,7H2,2H3
NCI pathway
Reactome pathway
n/an/a 2.10E+3n/an/an/an/an/an/a
Bristol-Myers Squibb Pharmaceuticals
Curated by ChEMBL
Assay Description
Inhibition of TNF-alpha binding to TNFRc1
Bioorg Med Chem Lett 13: 533-8 (2003)
BindingDB Entry DOI: 10.7270/Q2X929N3