BDBM50123459 CHEMBL3621458
SMILES: COc1cccc(c1)-c1ccc(C(N)=O)c2[nH]c3ccc(cc3c12)C(=O)N1CCN(C)CC1
InChI Key: InChIKey=NWQDPJSDGXLPIQ-UHFFFAOYSA-N
Data: 1 IC50
Activity Spreadsheet -- Enzyme Inhibition Constant Data from BindingDB
Found 1 hit for monomerid = 50123459
Trg + Lig
Ki
nM
ΔG°
kcal/mole
IC50
nM
Kd
nM
EC50/IC50
nM
koff
s-1
kon
M-1s-1
pHTemp
°C
Tyrosine-protein kinase BTK
(Homo sapiens (Human))
BDBM50123459
(CHEMBL3621458)
Show SMILES COc1cccc(c1)-c1ccc(C(N)=O)c2[nH]c3ccc(cc3c12)C(=O)N1CCN(C)CC1
Show InChI InChI=1S/C26H26N4O3/c1-29-10-12-30(13-11-29)26(32)17-6-9-22-21(15-17)23-19(16-4-3-5-18(14-16)33-2)7-8-20(25(27)31)24(23)28-22/h3-9,14-15,28H,10-13H2,1-2H3,(H2,27,31)
NCI pathway
Reactome pathway
n/an/a 28n/an/an/an/an/an/a
Bristol-Myers Squibb Pharmaceutical Research Institute
Curated by ChEMBL
Assay Description
Inhibition of human recombinant BTK
Bioorg Med Chem Lett 25: 4265-9 (2015)
BindingDB Entry DOI: 10.7270/Q2251M17