null
SMILES: CC(C)C[C@H](NC(=O)c1ccccc1-c1ccccc1CNC(=O)OCc1ccccc1)C(N)=O
InChI Key: InChIKey=QXKHSISTTMTXCV-VWLOTQADSA-N
Activity Spreadsheet -- Enzyme Inhibition Constant Data from BindingDB
Found 1 hit for monomerid = 50123525
Trg + Lig
Ki
nM
ΔG°
kcal/mole
IC50
nM
Kd
nM
EC50/IC50
nM
koff
s-1
kon
M-1s-1
pHTemp
°C
Potassium voltage-gated channel subfamily A member 5
(Homo sapiens (Human))
BDBM50123525
(CHEMBL146482 | [2'-(1-Carbamoyl-3-methyl-butylcarb...)
Show SMILES CC(C)C[C@H](NC(=O)c1ccccc1-c1ccccc1CNC(=O)OCc1ccccc1)C(N)=O
Show InChI InChI=1S/C28H31N3O4/c1-19(2)16-25(26(29)32)31-27(33)24-15-9-8-14-23(24)22-13-7-6-12-21(22)17-30-28(34)35-18-20-10-4-3-5-11-20/h3-15,19,25H,16-18H2,1-2H3,(H2,29,32)(H,30,34)(H,31,33)/t25-/m0/s1
n/an/a 300n/an/an/an/an/an/a
Aventis Pharma Deutschland GmbH
Curated by ChEMBL
Assay Description
Inhibition of human voltage-gated potassium channel subunit Kv1.5 expressed in Xenopus oocytes
J Med Chem 46: 486-98 (2003)
Article DOI: 10.1021/jm0210461
BindingDB Entry DOI: 10.7270/Q2RJ4HTF