BDBM50123539 CHEMBL3621505
SMILES: CNC(=O)c1cccc(c1)-c1ccc(C(N)=O)c2[nH]c3cc(ccc3c12)C(=O)N1CCN(C)CC1
InChI Key: InChIKey=LWSOLXNGAJLGNW-UHFFFAOYSA-N
Data: 1 IC50
Activity Spreadsheet -- Enzyme Inhibition Constant Data from BindingDB
Found 1 hit for monomerid = 50123539
Trg + Lig
Ki
nM
ΔG°
kcal/mole
IC50
nM
Kd
nM
EC50/IC50
nM
koff
s-1
kon
M-1s-1
pHTemp
°C
Tyrosine-protein kinase BTK
(Homo sapiens (Human))
BDBM50123539
(CHEMBL3621505)
Show SMILES CNC(=O)c1cccc(c1)-c1ccc(C(N)=O)c2[nH]c3cc(ccc3c12)C(=O)N1CCN(C)CC1
Show InChI InChI=1S/C27H27N5O3/c1-29-26(34)17-5-3-4-16(14-17)19-8-9-21(25(28)33)24-23(19)20-7-6-18(15-22(20)30-24)27(35)32-12-10-31(2)11-13-32/h3-9,14-15,30H,10-13H2,1-2H3,(H2,28,33)(H,29,34)
NCI pathway
Reactome pathway
n/an/a 71n/an/an/an/an/an/a
Bristol-Myers Squibb Pharmaceutical Research Institute
Curated by ChEMBL
Assay Description
Inhibition of human recombinant BTK
Bioorg Med Chem Lett 25: 4265-9 (2015)
BindingDB Entry DOI: 10.7270/Q2251M17