BDBM50123541 CHEMBL3621507
SMILES: CN1CCN(CC1)C(=O)c1ccc2c(c1)[nH]c1c(ccc(-c3ccc(cc3)C(C)(C)C)c21)C(N)=O
InChI Key: InChIKey=MVZJUDQAWDVDPO-UHFFFAOYSA-N
Data: 1 IC50
Activity Spreadsheet -- Enzyme Inhibition Constant Data from BindingDB
Found 1 hit for monomerid = 50123541
Trg + Lig
Ki
nM
ΔG°
kcal/mole
IC50
nM
Kd
nM
EC50/IC50
nM
koff
s-1
kon
M-1s-1
pHTemp
°C
Tyrosine-protein kinase BTK
(Homo sapiens (Human))
BDBM50123541
(CHEMBL3621507)
Show SMILES CN1CCN(CC1)C(=O)c1ccc2c(c1)[nH]c1c(ccc(-c3ccc(cc3)C(C)(C)C)c21)C(N)=O
Show InChI InChI=1S/C29H32N4O2/c1-29(2,3)20-8-5-18(6-9-20)21-11-12-23(27(30)34)26-25(21)22-10-7-19(17-24(22)31-26)28(35)33-15-13-32(4)14-16-33/h5-12,17,31H,13-16H2,1-4H3,(H2,30,34)
NCI pathway
Reactome pathway
n/an/a 103n/an/an/an/an/an/a
Bristol-Myers Squibb Pharmaceutical Research Institute
Curated by ChEMBL
Assay Description
Inhibition of human recombinant BTK
Bioorg Med Chem Lett 25: 4265-9 (2015)
BindingDB Entry DOI: 10.7270/Q2251M17