BDBM50123549 CHEMBL3621516
SMILES: CN1CCN(CC1)C(=O)c1ccc2c(c1)[nH]c1c(ccc(-c3ccc(F)cc3F)c21)C(N)=O
InChI Key: InChIKey=JVIAAKFJHTYMBN-UHFFFAOYSA-N
Data: 1 IC50
Activity Spreadsheet -- Enzyme Inhibition Constant Data from BindingDB
Found 1 hit for monomerid = 50123549
Trg + Lig
Ki
nM
ΔG°
kcal/mole
IC50
nM
Kd
nM
EC50/IC50
nM
koff
s-1
kon
M-1s-1
pHTemp
°C
Tyrosine-protein kinase BTK
(Homo sapiens (Human))
BDBM50123549
(CHEMBL3621516)
Show SMILES CN1CCN(CC1)C(=O)c1ccc2c(c1)[nH]c1c(ccc(-c3ccc(F)cc3F)c21)C(N)=O
Show InChI InChI=1S/C25H22F2N4O2/c1-30-8-10-31(11-9-30)25(33)14-2-4-18-21(12-14)29-23-19(24(28)32)7-6-17(22(18)23)16-5-3-15(26)13-20(16)27/h2-7,12-13,29H,8-11H2,1H3,(H2,28,32)
NCI pathway
Reactome pathway
n/an/a 22n/an/an/an/an/an/a
Bristol-Myers Squibb Pharmaceutical Research Institute
Curated by ChEMBL
Assay Description
Inhibition of human recombinant BTK
Bioorg Med Chem Lett 25: 4265-9 (2015)
BindingDB Entry DOI: 10.7270/Q2251M17