BDBM50123563 CHEMBL3622198
SMILES: COc1cccc(c1)-c1cc(C(N)=O)c2[nH]c3cc(ccc3c2c1)C(=O)N1CCN(C)CC1
InChI Key: InChIKey=GBXATFDIRDSUJB-UHFFFAOYSA-N
Data: 2 IC50
Activity Spreadsheet -- Enzyme Inhibition Constant Data from BindingDB
Found 2 hits for monomerid = 50123563
Trg + Lig
Ki
nM
ΔG°
kcal/mole
IC50
nM
Kd
nM
EC50/IC50
nM
koff
s-1
kon
M-1s-1
pHTemp
°C
Tyrosine-protein kinase JAK2
(Homo sapiens (Human))
BDBM50123563
(CHEMBL3622198)
Show SMILES COc1cccc(c1)-c1cc(C(N)=O)c2[nH]c3cc(ccc3c2c1)C(=O)N1CCN(C)CC1
Show InChI InChI=1S/C26H26N4O3/c1-29-8-10-30(11-9-29)26(32)17-6-7-20-21-13-18(16-4-3-5-19(12-16)33-2)14-22(25(27)31)24(21)28-23(20)15-17/h3-7,12-15,28H,8-11H2,1-2H3,(H2,27,31)
Reactome pathway
n/an/a 4.30n/an/an/an/an/an/a
Bristol-Myers Squibb Pharmaceutical Research Institute
Curated by ChEMBL
Assay Description
Inhibition of JAK2 (unknown origin)
Bioorg Med Chem Lett 25: 4265-9 (2015)
BindingDB Entry DOI: 10.7270/Q2251M17
Tyrosine-protein kinase BTK
(Homo sapiens (Human))
BDBM50123563
(CHEMBL3622198)
Show SMILES COc1cccc(c1)-c1cc(C(N)=O)c2[nH]c3cc(ccc3c2c1)C(=O)N1CCN(C)CC1
Show InChI InChI=1S/C26H26N4O3/c1-29-8-10-30(11-9-29)26(32)17-6-7-20-21-13-18(16-4-3-5-19(12-16)33-2)14-22(25(27)31)24(21)28-23(20)15-17/h3-7,12-15,28H,8-11H2,1-2H3,(H2,27,31)
NCI pathway
Reactome pathway
n/an/a 404n/an/an/an/an/an/a
Bristol-Myers Squibb Pharmaceutical Research Institute
Curated by ChEMBL
Assay Description
Inhibition of human recombinant BTK
Bioorg Med Chem Lett 25: 4265-9 (2015)
BindingDB Entry DOI: 10.7270/Q2251M17