BDBM50123572 (3-{4-[3-(Bis-quinolin-4-ylmethyl-amino)-propyl]-piperazin-1-yl}-propyl)-(7-chloro-quinolin-4-yl)-amine::CHEMBL152052::N-(3-(4-(3-(bis(quinolin-4-ylmethyl)amino)propyl)piperazin-1-yl)propyl)-7-chloroquinolin-4-amine
SMILES: Clc1ccc2c(NCCCN3CCN(CCCN(Cc4ccnc5ccccc45)Cc4ccnc5ccccc45)CC3)ccnc2c1
InChI Key: InChIKey=MNENSRQYBWNZDD-UHFFFAOYSA-N
Data: 1 IC50
Activity Spreadsheet -- Enzyme Inhibition Constant Data from BindingDB
Found 1 hit for monomerid = 50123572
Trg + Lig
Ki
nM
ΔG°
kcal/mole
IC50
nM
Kd
nM
EC50/IC50
nM
koff
s-1
kon
M-1s-1
pHTemp
°C
Histidine-rich protein
(Plasmodium falciparum)
BDBM50123572
((3-{4-[3-(Bis-quinolin-4-ylmethyl-amino)-propyl]-p...)
Show SMILES Clc1ccc2c(NCCCN3CCN(CCCN(Cc4ccnc5ccccc45)Cc4ccnc5ccccc45)CC3)ccnc2c1
Show InChI InChI=1S/C39H42ClN7/c40-32-11-12-35-38(15-19-44-39(35)27-32)41-16-5-20-45-23-25-46(26-24-45)21-6-22-47(28-30-13-17-42-36-9-3-1-7-33(30)36)29-31-14-18-43-37-10-4-2-8-34(31)37/h1-4,7-15,17-19,27H,5-6,16,20-26,28-29H2,(H,41,44)
n/an/a 43.4n/an/an/an/an/an/a
Universit£ de Lille II
Curated by ChEMBL
Assay Description
In vitro inhibition of beta-hematin formation
J Med Chem 46: 542-57 (2003)
Article DOI: 10.1021/jm020960r
BindingDB Entry DOI: 10.7270/Q27W6DDC