BDBM50123806 CHEMBL3623373
SMILES: CC(C)(C)c1cc(NC(=O)Nc2ccc(cc2)-c2cn3c(csc3n2)C(=O)NCCS(C)(=O)=O)no1
InChI Key: InChIKey=CKXVBFFBNWSINA-UHFFFAOYSA-N
Data: 1 IC50
Activity Spreadsheet -- Enzyme Inhibition Constant Data from BindingDB
Found 1 hit for monomerid = 50123806
Trg + Lig
Ki
nM
ΔG°
kcal/mole
IC50
nM
Kd
nM
EC50/IC50
nM
koff
s-1
kon
M-1s-1
pHTemp
°C
Receptor-type tyrosine-protein kinase FLT3
(Homo sapiens (Human))
BDBM50123806
(CHEMBL3623373)
Show SMILES CC(C)(C)c1cc(NC(=O)Nc2ccc(cc2)-c2cn3c(csc3n2)C(=O)NCCS(C)(=O)=O)no1
Show InChI InChI=1S/C23H26N6O5S2/c1-23(2,3)18-11-19(28-34-18)27-21(31)25-15-7-5-14(6-8-15)16-12-29-17(13-35-22(29)26-16)20(30)24-9-10-36(4,32)33/h5-8,11-13H,9-10H2,1-4H3,(H,24,30)(H2,25,27,28,31)
n/an/a 95n/an/an/an/an/an/a
Sichuan University
Curated by ChEMBL
Assay Description
Inhibition of human recombinant Flt3
Bioorg Med Chem Lett 25: 4534-8 (2015)
BindingDB Entry DOI: 10.7270/Q24X59MV