BDBM50123867 Benzoyl-(4-bromo-phenyl)-thiocarbamic acid O-[2-(1,3-dioxo-1,3-dihydro-isoindol-2-yl)-ethyl] ester::CHEMBL164511
SMILES: Brc1ccc(cc1)N(C(=S)OCCN1C(=O)c2ccccc2C1=O)C(=O)c1ccccc1
InChI Key: InChIKey=SDCYYYJRPPHIEQ-UHFFFAOYSA-N
Data: 1 EC50
Activity Spreadsheet -- Enzyme Inhibition Constant Data from BindingDB
Found 1 hit for monomerid = 50123867
Trg + Lig
Ki
nM
ΔG°
kcal/mole
IC50
nM
Kd
nM
EC50/IC50
nM
koff
s-1
kon
M-1s-1
pHTemp
°C
Human immunodeficiency virus type 1 reverse transcriptase
(Human immunodeficiency virus 1)
BDBM50123867
(Benzoyl-(4-bromo-phenyl)-thiocarbamic acid O-[2-(1...)
Show SMILES Brc1ccc(cc1)N(C(=S)OCCN1C(=O)c2ccccc2C1=O)C(=O)c1ccccc1
Show InChI InChI=1S/C24H17BrN2O4S/c25-17-10-12-18(13-11-17)27(21(28)16-6-2-1-3-7-16)24(32)31-15-14-26-22(29)19-8-4-5-9-20(19)23(26)30/h1-13H,14-15H2
n/an/an/an/a 35n/an/an/an/a
Università di Genova
Curated by ChEMBL
Assay Description
Concentration required to achieve 50% protection of MT-4 cell from the HIV-1 induced cytopathogenicity was determined by the MTT method
J Med Chem 46: 768-81 (2003)
Article DOI: 10.1021/jm0209984
BindingDB Entry DOI: 10.7270/Q2BC3XXX