BDBM50123877 Benzoyl-phenyl-thiocarbamic acid O-furan-2-ylmethyl ester::CHEMBL165965
SMILES: O=C(N(C(=S)OCc1ccco1)c1ccccc1)c1ccccc1
InChI Key: InChIKey=BEQSSZPWVMWZAJ-UHFFFAOYSA-N
Data: 1 EC50
Activity Spreadsheet -- Enzyme Inhibition Constant Data from BindingDB
Found 1 hit for monomerid = 50123877
Trg + Lig
Ki
nM
ΔG°
kcal/mole
IC50
nM
Kd
nM
EC50/IC50
nM
koff
s-1
kon
M-1s-1
pHTemp
°C
Human immunodeficiency virus type 1 reverse transcriptase
(Human immunodeficiency virus 1)
BDBM50123877
(Benzoyl-phenyl-thiocarbamic acid O-furan-2-ylmethy...)
Show SMILES O=C(N(C(=S)OCc1ccco1)c1ccccc1)c1ccccc1
Show InChI InChI=1S/C19H15NO3S/c21-18(15-8-3-1-4-9-15)20(16-10-5-2-6-11-16)19(24)23-14-17-12-7-13-22-17/h1-13H,14H2
n/an/an/an/a>3.83E+4n/an/an/an/a
Università di Genova
Curated by ChEMBL
Assay Description
Concentration required to achieve 50% protection of MT-4 cell from the HIV-1 induced cytopathogenicity was determined by the MTT method
J Med Chem 46: 768-81 (2003)
Article DOI: 10.1021/jm0209984
BindingDB Entry DOI: 10.7270/Q2BC3XXX