BDBM50123888 (2-Ethyl-phenyl)-(thiophene-2-carbonyl)-thiocarbamic acid O-[2-(1,3-dioxo-1,3-dihydro-isoindol-2-yl)-ethyl] ester::CHEMBL351849
SMILES: CCc1ccccc1N(C(=S)OCCN1C(=O)c2ccccc2C1=O)C(=O)c1cccs1
InChI Key: InChIKey=ASCVMMBBYCKNNV-UHFFFAOYSA-N
Data: 1 EC50
Activity Spreadsheet -- Enzyme Inhibition Constant Data from BindingDB
Found 1 hit for monomerid = 50123888
Trg + Lig
Ki
nM
ΔG°
kcal/mole
IC50
nM
Kd
nM
EC50/IC50
nM
koff
s-1
kon
M-1s-1
pHTemp
°C
Human immunodeficiency virus type 1 reverse transcriptase
(Human immunodeficiency virus 1)
BDBM50123888
((2-Ethyl-phenyl)-(thiophene-2-carbonyl)-thiocarbam...)
Show SMILES CCc1ccccc1N(C(=S)OCCN1C(=O)c2ccccc2C1=O)C(=O)c1cccs1
Show InChI InChI=1S/C24H20N2O4S2/c1-2-16-8-3-6-11-19(16)26(23(29)20-12-7-15-32-20)24(31)30-14-13-25-21(27)17-9-4-5-10-18(17)22(25)28/h3-12,15H,2,13-14H2,1H3
n/an/an/an/a 1.10E+4n/an/an/an/a
Università di Genova
Curated by ChEMBL
Assay Description
Concentration required to achieve 50% protection of MT-4 cell from the HIV-1 induced cytopathogenicity was determined by the MTT method
J Med Chem 46: 768-81 (2003)
Article DOI: 10.1021/jm0209984
BindingDB Entry DOI: 10.7270/Q2BC3XXX