BDBM50123904 (3,5-Dichloro-benzoyl)-phenyl-thiocarbamic acid O-(2-phenoxy-ethyl) ester::CHEMBL165232
SMILES: Clc1cc(Cl)cc(c1)C(=O)N(C(=S)OCCOc1ccccc1)c1ccccc1
InChI Key: InChIKey=IJLMEFFRGWXVNZ-UHFFFAOYSA-N
Data: 1 EC50
Activity Spreadsheet -- Enzyme Inhibition Constant Data from BindingDB
Found 1 hit for monomerid = 50123904
Trg + Lig
Ki
nM
ΔG°
kcal/mole
IC50
nM
Kd
nM
EC50/IC50
nM
koff
s-1
kon
M-1s-1
pHTemp
°C
Human immunodeficiency virus type 1 reverse transcriptase
(Human immunodeficiency virus 1)
BDBM50123904
((3,5-Dichloro-benzoyl)-phenyl-thiocarbamic acid O-...)
Show SMILES Clc1cc(Cl)cc(c1)C(=O)N(C(=S)OCCOc1ccccc1)c1ccccc1
Show InChI InChI=1S/C22H17Cl2NO3S/c23-17-13-16(14-18(24)15-17)21(26)25(19-7-3-1-4-8-19)22(29)28-12-11-27-20-9-5-2-6-10-20/h1-10,13-15H,11-12H2
n/an/an/an/a 8.80E+3n/an/an/an/a
Università di Genova
Curated by ChEMBL
Assay Description
Concentration required to achieve 50% protection of MT-4 cell from the HIV-1 induced cytopathogenicity was determined by the MTT method
J Med Chem 46: 768-81 (2003)
Article DOI: 10.1021/jm0209984
BindingDB Entry DOI: 10.7270/Q2BC3XXX