BDBM50123921 (3-Nitro-benzoyl)-phenyl-thiocarbamic acid O-(1-methyl-2-phenoxy-ethyl) ester::CHEMBL167896
SMILES: CC(COc1ccccc1)OC(=S)N(C(=O)c1cccc(c1)[N+]([O-])=O)c1ccccc1
InChI Key: InChIKey=NEGULEIQDBJMRM-UHFFFAOYSA-N
Data: 1 EC50
Activity Spreadsheet -- Enzyme Inhibition Constant Data from BindingDB
Found 1 hit for monomerid = 50123921
Trg + Lig
Ki
nM
ΔG°
kcal/mole
IC50
nM
Kd
nM
EC50/IC50
nM
koff
s-1
kon
M-1s-1
pHTemp
°C
Human immunodeficiency virus type 1 reverse transcriptase
(Human immunodeficiency virus 1)
BDBM50123921
((3-Nitro-benzoyl)-phenyl-thiocarbamic acid O-(1-me...)
Show SMILES CC(COc1ccccc1)OC(=S)N(C(=O)c1cccc(c1)[N+]([O-])=O)c1ccccc1
Show InChI InChI=1S/C23H20N2O5S/c1-17(16-29-21-13-6-3-7-14-21)30-23(31)24(19-10-4-2-5-11-19)22(26)18-9-8-12-20(15-18)25(27)28/h2-15,17H,16H2,1H3
n/an/an/an/a 3.60E+3n/an/an/an/a
Università di Genova
Curated by ChEMBL
Assay Description
Concentration required to achieve 50% protection of MT-4 cell from the HIV-1 induced cytopathogenicity was determined by the MTT method
J Med Chem 46: 768-81 (2003)
Article DOI: 10.1021/jm0209984
BindingDB Entry DOI: 10.7270/Q2BC3XXX