BDBM50124022 CHEMBL169307::N-(1-Formyl-2-phenyl-ethyl)-3-methyl-2-(naphthalene-2-sulfonylamino)-butyramide
SMILES: CC(C)[C@H](NS(=O)(=O)c1ccc2ccccc2c1)C(=O)N[C@H](Cc1ccccc1)C=O
InChI Key: InChIKey=SJKUJZDIIXDACO-GGAORHGYSA-N
Data: 1 IC50
Activity Spreadsheet -- Enzyme Inhibition Constant Data from BindingDB
Found 1 hit for monomerid = 50124022
Trg + Lig
Ki
nM
ΔG°
kcal/mole
IC50
nM
Kd
nM
EC50/IC50
nM
koff
s-1
kon
M-1s-1
pHTemp
°C
Calpain1
(Homo sapiens (Human))
BDBM50124022
(CHEMBL169307 | N-(1-Formyl-2-phenyl-ethyl)-3-methy...)
Show SMILES CC(C)[C@H](NS(=O)(=O)c1ccc2ccccc2c1)C(=O)N[C@H](Cc1ccccc1)C=O
Show InChI InChI=1S/C24H26N2O4S/c1-17(2)23(24(28)25-21(16-27)14-18-8-4-3-5-9-18)26-31(29,30)22-13-12-19-10-6-7-11-20(19)15-22/h3-13,15-17,21,23,26H,14H2,1-2H3,(H,25,28)/t21-,23+/m1/s1
Reactome pathway
n/an/a 14n/an/an/an/an/an/a
Senju Pharmaceutical Co.
Curated by ChEMBL
Assay Description
In vitro inhibition of porcine mu-calpain.
J Med Chem 46: 868-71 (2003)
Article DOI: 10.1021/jm0201924
BindingDB Entry DOI: 10.7270/Q2TB168Z