BDBM50124056 2-((S)-2-{(S)-8-Methyl-4-oxo-3-(3-trifluoromethyl-benzylamino)-6-[(R)-1-((S)-6,9,9-trimethyl-3,5-dioxa-4-bora-tricyclo[6.1.1.0*2,6*]dec-4-yl)-propylcarbamoyl]-4,6,7,8-tetrahydro-pyrrolo[1,2-a]pyrimidin-8-yl}-acetylamino)-benzoic acid methyl ester::CHEMBL350980
SMILES: CC[C@H](NC(=O)[C@@H]1C[C@@](C)(CC(=O)Nc2ccccc2C(=O)OC)c2ncc(NCc3cccc(c3)C(F)(F)F)c(=O)n12)B1OC2C3CC(C[C@]2(C)O1)C3(C)C
InChI Key: InChIKey=FHQCCLXYBQJBFQ-KQGVQOGSSA-N
Data: 1 IC50
Activity Spreadsheet -- Enzyme Inhibition Constant Data from BindingDB
Found 1 hit for monomerid = 50124056
Trg + Lig
Ki
nM
ΔG°
kcal/mole
IC50
nM
Kd
nM
EC50/IC50
nM
koff
s-1
kon
M-1s-1
pHTemp
°C
Hepatitis C virus serine protease, NS3/NS4A
(Hepatitis C virus)
BDBM50124056
(2-((S)-2-{(S)-8-Methyl-4-oxo-3-(3-trifluoromethyl-...)
Show SMILES CC[C@H](NC(=O)[C@@H]1C[C@@](C)(CC(=O)Nc2ccccc2C(=O)OC)c2ncc(NCc3cccc(c3)C(F)(F)F)c(=O)n12)B1OC2C3CC(C[C@]2(C)O1)C3(C)C
Show InChI InChI=1S/C40H47BF3N5O7/c1-7-30(41-55-32-26-16-24(37(26,2)3)17-39(32,5)56-41)48-33(51)29-18-38(4,19-31(50)47-27-14-9-8-13-25(27)35(53)54-6)36-46-21-28(34(52)49(29)36)45-20-22-11-10-12-23(15-22)40(42,43)44/h8-15,21,24,26,29-30,32,45H,7,16-20H2,1-6H3,(H,47,50)(H,48,51)/t24?,26?,29-,30-,32?,38-,39-/m0/s1
n/an/a 100n/an/an/an/an/an/a
Bristol-Myers Squibb Pharmaceutical Research Institute
Curated by ChEMBL
Assay Description
Inhibitory activity hepatitis C virus NS3 protease.
Bioorg Med Chem Lett 13: 785-8 (2003)
BindingDB Entry DOI: 10.7270/Q2JW8D84