BDBM50124254 3-(2',6'-Dimethoxy-biphenyl-4-yl)-2-({3-[(S)-2-(3-dimethylamino-propylamino)-ethanesulfonyl]-piperidine-3-carbonyl}-amino)-propionic acid::CHEMBL172396
SMILES: COc1cccc(OC)c1-c1ccc(C[C@H](NC(=O)C2(CCCNC2)S(=O)(=O)CCNCCCN(C)C)C(O)=O)cc1
InChI Key: InChIKey=CJASQSIGTKSMFJ-YJJLJQPASA-N
Data: 2 IC50
Activity Spreadsheet -- Enzyme Inhibition Constant Data from BindingDB
Found 2 hits for monomerid = 50124254
Trg + Lig
Ki
nM
ΔG°
kcal/mole
IC50
nM
Kd
nM
EC50/IC50
nM
koff
s-1
kon
M-1s-1
pHTemp
°C
Integrin α4β7
(Homo sapiens (Human))
BDBM50124254
(3-(2',6'-Dimethoxy-biphenyl-4-yl)-2-({3-[(S)-2-(3-...)
Show SMILES COc1cccc(OC)c1-c1ccc(C[C@H](NC(=O)C2(CCCNC2)S(=O)(=O)CCNCCCN(C)C)C(O)=O)cc1
Show InChI InChI=1S/C30H44N4O7S/c1-34(2)18-7-16-31-17-19-42(38,39)30(14-6-15-32-21-30)29(37)33-24(28(35)36)20-22-10-12-23(13-11-22)27-25(40-3)8-5-9-26(27)41-4/h5,8-13,24,31-32H,6-7,14-21H2,1-4H3,(H,33,37)(H,35,36)/t24-,30?/m0/s1
NCI pathway
Reactome pathway
n/an/a 179n/an/an/an/an/an/a
Merck Research Laboratories
Curated by ChEMBL
Assay Description
Binding affinity towards VLA-4 (alpha4 beta7) receptor in human RPMI-8866 B-cell line using [125I]MAdCAM-Ig as radioligand
Bioorg Med Chem Lett 13: 885-90 (2003)
BindingDB Entry DOI: 10.7270/Q2X34WVH
Fibronectin receptor beta/Integrin alpha-4
(Homo sapiens (Human))
BDBM50124254
(3-(2',6'-Dimethoxy-biphenyl-4-yl)-2-({3-[(S)-2-(3-...)
Show SMILES COc1cccc(OC)c1-c1ccc(C[C@H](NC(=O)C2(CCCNC2)S(=O)(=O)CCNCCCN(C)C)C(O)=O)cc1
Show InChI InChI=1S/C30H44N4O7S/c1-34(2)18-7-16-31-17-19-42(38,39)30(14-6-15-32-21-30)29(37)33-24(28(35)36)20-22-10-12-23(13-11-22)27-25(40-3)8-5-9-26(27)41-4/h5,8-13,24,31-32H,6-7,14-21H2,1-4H3,(H,33,37)(H,35,36)/t24-,30?/m0/s1
Reactome pathway
n/an/a 0.370n/an/an/an/an/an/a
Merck Research Laboratories
Curated by ChEMBL
Assay Description
Binding affinity towards VLA-4 (alpha4 beta-1) receptor in human Jurkat cells using [125I]VCAM-Ig as radioligand
Bioorg Med Chem Lett 13: 885-90 (2003)
BindingDB Entry DOI: 10.7270/Q2X34WVH