null
SMILES: Nc1ncc(s1)-c1ccncc1-c1ccccc1Cl
InChI Key: InChIKey=DBAQXRPFHQUQMA-UHFFFAOYSA-N
Activity Spreadsheet -- Enzyme Inhibition Constant Data from BindingDB
Found 2 hits for monomerid = 50124364
Trg + Lig
Ki
nM
ΔG°
kcal/mole
IC50
nM
Kd
nM
EC50/IC50
nM
koff
s-1
kon
M-1s-1
pHTemp
°C
LIM domain kinase 1
(Homo sapiens (Human))
BDBM50124364
(CHEMBL3622875)
Show SMILES Nc1ncc(s1)-c1ccncc1-c1ccccc1Cl
Show InChI InChI=1S/C14H10ClN3S/c15-12-4-2-1-3-9(12)11-7-17-6-5-10(11)13-8-18-14(16)19-13/h1-8H,(H2,16,18)
Reactome pathway
n/an/a>3.00E+4n/an/an/an/an/an/a
Cancer Research Technology
Curated by ChEMBL
Assay Description
Inhibition of LIMK1 in human ZR75-1 cells assessed as inhibition of cofilin phosphorylation after 5 hrs
J Med Chem 58: 8309-13 (2015)
BindingDB Entry DOI: 10.7270/Q27P917N
LIM domain kinase 1
(Homo sapiens (Human))
BDBM50124364
(CHEMBL3622875)
Show SMILES Nc1ncc(s1)-c1ccncc1-c1ccccc1Cl
Show InChI InChI=1S/C14H10ClN3S/c15-12-4-2-1-3-9(12)11-7-17-6-5-10(11)13-8-18-14(16)19-13/h1-8H,(H2,16,18)
Reactome pathway
n/an/a 270n/an/an/an/an/an/a
Cancer Research Technology
Curated by ChEMBL
Assay Description
Inhibition of recombinant N-terminal 6His-tagged LIMK1 (unknown origin) expressed in Sf21 cells by HTRF assay using cofilin as a substrate
J Med Chem 58: 8309-13 (2015)
BindingDB Entry DOI: 10.7270/Q27P917N