BDBM50124798 2-[3-(3-Bromo-2-ethoxy-5-iodo-benzylamino)-propylamino]-1H-quinolin-4-one::CHEMBL160597
SMILES: CCOc1c(Br)cc(I)cc1CNCCCNc1cc(O)c2ccccc2n1
InChI Key: InChIKey=WVOMXHBUPWHREX-UHFFFAOYSA-N
Data: 1 IC50
Activity Spreadsheet -- Enzyme Inhibition Constant Data from BindingDB
Found 1 hit for monomerid = 50124798
Trg + Lig
Ki
nM
ΔG°
kcal/mole
IC50
nM
Kd
nM
EC50/IC50
nM
koff
s-1
kon
M-1s-1
pHTemp
°C
Methionyl-tRNA synthetase
(Escherichia coli (strain K12))
BDBM50124798
(2-[3-(3-Bromo-2-ethoxy-5-iodo-benzylamino)-propyla...)
Show SMILES CCOc1c(Br)cc(I)cc1CNCCCNc1cc(O)c2ccccc2n1
Show InChI InChI=1S/C21H23BrIN3O2/c1-2-28-21-14(10-15(23)11-17(21)22)13-24-8-5-9-25-20-12-19(27)16-6-3-4-7-18(16)26-20/h3-4,6-7,10-12,24H,2,5,8-9,13H2,1H3,(H2,25,26,27)
n/an/a 8.80n/an/an/an/an/an/a
GlaxoSmithKline
Curated by ChEMBL
Assay Description
Compound tested for inhibition of Staphylococcus aureus MRS(methionyl tRNA synthetase) in aminoacylation assay
Bioorg Med Chem Lett 13: 665-8 (2003)
BindingDB Entry DOI: 10.7270/Q2KP81JD