BDBM50124803 5-Bromo-2-ethoxy-3-{[3-(4-oxo-1,4-dihydro-quinolin-2-ylamino)-propylamino]-methyl}-benzonitrile::CHEMBL159035
SMILES: CCOc1c(CNCCCNc2cc(O)c3ccccc3n2)cc(Br)cc1C#N
InChI Key: InChIKey=GGBQAUAEORMQNP-UHFFFAOYSA-N
Data: 1 IC50
Activity Spreadsheet -- Enzyme Inhibition Constant Data from BindingDB
Found 1 hit for monomerid = 50124803
Trg + Lig
Ki
nM
ΔG°
kcal/mole
IC50
nM
Kd
nM
EC50/IC50
nM
koff
s-1
kon
M-1s-1
pHTemp
°C
Methionyl-tRNA synthetase
(Escherichia coli (strain K12))
BDBM50124803
(5-Bromo-2-ethoxy-3-{[3-(4-oxo-1,4-dihydro-quinolin...)
Show SMILES CCOc1c(CNCCCNc2cc(O)c3ccccc3n2)cc(Br)cc1C#N
Show InChI InChI=1S/C22H23BrN4O2/c1-2-29-22-15(13-24)10-17(23)11-16(22)14-25-8-5-9-26-21-12-20(28)18-6-3-4-7-19(18)27-21/h3-4,6-7,10-12,25H,2,5,8-9,14H2,1H3,(H2,26,27,28)
n/an/a 4n/an/an/an/an/an/a
GlaxoSmithKline
Curated by ChEMBL
Assay Description
Compound tested for inhibition of Staphylococcus aureus MRS (methionyl tRNA synthetase) in aminoacylation assay
Bioorg Med Chem Lett 13: 665-8 (2003)
BindingDB Entry DOI: 10.7270/Q2KP81JD