BDBM50124824 3-Bromo-4-ethoxy-5-{[3-(4-oxo-1,4-dihydro-quinolin-2-ylamino)-propylamino]-methyl}-benzonitrile::CHEMBL158501
SMILES: CCOc1c(Br)cc(cc1CNCCCNc1cc(O)c2ccccc2n1)C#N
InChI Key: InChIKey=NEMATKSPKXWIKZ-UHFFFAOYSA-N
Data: 1 IC50
Activity Spreadsheet -- Enzyme Inhibition Constant Data from BindingDB
Found 1 hit for monomerid = 50124824
Trg + Lig
Ki
nM
ΔG°
kcal/mole
IC50
nM
Kd
nM
EC50/IC50
nM
koff
s-1
kon
M-1s-1
pHTemp
°C
Methionyl-tRNA synthetase
(Escherichia coli (strain K12))
BDBM50124824
(3-Bromo-4-ethoxy-5-{[3-(4-oxo-1,4-dihydro-quinolin...)
Show SMILES CCOc1c(Br)cc(cc1CNCCCNc1cc(O)c2ccccc2n1)C#N
Show InChI InChI=1S/C22H23BrN4O2/c1-2-29-22-16(10-15(13-24)11-18(22)23)14-25-8-5-9-26-21-12-20(28)17-6-3-4-7-19(17)27-21/h3-4,6-7,10-12,25H,2,5,8-9,14H2,1H3,(H2,26,27,28)
n/an/a 4.60n/an/an/an/an/an/a
GlaxoSmithKline
Curated by ChEMBL
Assay Description
Compound tested for inhibition of Staphylococcus aureus MRS(methionyl tRNA synthetase) in aminoacylation assay
Bioorg Med Chem Lett 13: 665-8 (2003)
BindingDB Entry DOI: 10.7270/Q2KP81JD