BDBM50124884 CHEMBL3623563
SMILES: CCC(C)n1cc(cn1)C(=O)CF
InChI Key: InChIKey=MKFBTCMZCVVDQG-UHFFFAOYSA-N
Data: 4 IC50
Activity Spreadsheet -- Enzyme Inhibition Constant Data from BindingDB
Found 4 hits for monomerid = 50124884
Trg + Lig
Ki
nM
ΔG°
kcal/mole
IC50
nM
Kd
nM
EC50/IC50
nM
koff
s-1
kon
M-1s-1
pHTemp
°C
Acetylcholinesterase
(Homo sapiens (Human))
BDBM50124884
(CHEMBL3623563)
Show SMILES CCC(C)n1cc(cn1)C(=O)CF
Show InChI InChI=1S/C9H13FN2O/c1-3-7(2)12-6-8(5-11-12)9(13)4-10/h5-7H,3-4H2,1-2H3
NCI pathway
Reactome pathway
n/an/a 1.69E+4n/an/an/an/an/an/a
Virginia Tech
Curated by ChEMBL
Assay Description
Inhibition of recombinant human AChE after 10 mins by Ellman assay
Bioorg Med Chem Lett 25: 4405-11 (2015)
BindingDB Entry DOI: 10.7270/Q2Z60QV8
Acetylcholinesterase
(Anopheles gambiae)
BDBM50124884
(CHEMBL3623563)
Show SMILES CCC(C)n1cc(cn1)C(=O)CF
Show InChI InChI=1S/C9H13FN2O/c1-3-7(2)12-6-8(5-11-12)9(13)4-10/h5-7H,3-4H2,1-2H3
n/an/a 2.75E+3n/an/an/an/an/an/a
Virginia Tech
Curated by ChEMBL
Assay Description
Inhibition of recombinant Anopheles gambiae wild type AChE after 10 mins by Ellman assay
Bioorg Med Chem Lett 25: 4405-11 (2015)
BindingDB Entry DOI: 10.7270/Q2Z60QV8
Acetylcholinesterase
(Anopheles gambiae)
BDBM50124884
(CHEMBL3623563)
Show SMILES CCC(C)n1cc(cn1)C(=O)CF
Show InChI InChI=1S/C9H13FN2O/c1-3-7(2)12-6-8(5-11-12)9(13)4-10/h5-7H,3-4H2,1-2H3
n/an/a 2.86E+3n/an/an/an/an/an/a
Virginia Tech
Curated by ChEMBL
Assay Description
Inhibition of recombinant Anopheles gambiae wild type AChE after 60 mins by Ellman assay
Bioorg Med Chem Lett 25: 4405-11 (2015)
BindingDB Entry DOI: 10.7270/Q2Z60QV8
Acetylcholinesterase
(Homo sapiens (Human))
BDBM50124884
(CHEMBL3623563)
Show SMILES CCC(C)n1cc(cn1)C(=O)CF
Show InChI InChI=1S/C9H13FN2O/c1-3-7(2)12-6-8(5-11-12)9(13)4-10/h5-7H,3-4H2,1-2H3
NCI pathway
Reactome pathway
n/an/a 1.80E+4n/an/an/an/an/an/a
Virginia Tech
Curated by ChEMBL
Assay Description
Inhibition of recombinant human AChE after 60 mins by Ellman assay
Bioorg Med Chem Lett 25: 4405-11 (2015)
BindingDB Entry DOI: 10.7270/Q2Z60QV8