BDBM50124900 CHEMBL3623592
SMILES: COc1ccc(NC(=O)c2cccc(c2)[N+]([O-])=O)cc1OC
InChI Key: InChIKey=HOJSRIZTXFOCQL-UHFFFAOYSA-N
Data: 1 IC50
Activity Spreadsheet -- Enzyme Inhibition Constant Data from BindingDB
Found 1 hit for monomerid = 50124900
Trg + Lig
Ki
nM
ΔG°
kcal/mole
IC50
nM
Kd
nM
EC50/IC50
nM
koff
s-1
kon
M-1s-1
pHTemp
°C
SET domain-containing protein 7/9 (Set7/9)
(Homo sapiens (Human))
BDBM50124900
(CHEMBL3623592)
Show SMILES COc1ccc(NC(=O)c2cccc(c2)[N+]([O-])=O)cc1OC
Show InChI InChI=1S/C15H14N2O5/c1-21-13-7-6-11(9-14(13)22-2)16-15(18)10-4-3-5-12(8-10)17(19)20/h3-9H,1-2H3,(H,16,18)
n/an/a 3.00E+4n/an/an/an/an/an/a
Shanghai University
Curated by ChEMBL
Assay Description
Competitive inhibition of SET7 (unknown origin) after 60 mins by AlphaLISA method in presence of SAM
J Med Chem 58: 8166-81 (2015)
BindingDB Entry DOI: 10.7270/Q2TF005S