BDBM50125041 2-((R)-3-Benzyl-2-oxo-piperazin-1-yl)-N-[(S)-4-guanidino-1-(thiazole-2-carbonyl)-butyl]-acetamide::CHEMBL350048
SMILES: NC(=N)NCCC[C@H](NC(=O)CN1CCN[C@H](Cc2ccccc2)C1=O)C(=O)c1nccs1
InChI Key: InChIKey=CVVJWXLMPOAYBP-DLBZAZTESA-N
Data: 2 IC50
Activity Spreadsheet -- Enzyme Inhibition Constant Data from BindingDB
Found 2 hits for monomerid = 50125041
Trg + Lig
Ki
nM
ΔG°
kcal/mole
IC50
nM
Kd
nM
EC50/IC50
nM
koff
s-1
kon
M-1s-1
pHTemp
°C
Coagulation factor X
(Homo sapiens (Human))
BDBM50125041
(2-((R)-3-Benzyl-2-oxo-piperazin-1-yl)-N-[(S)-4-gua...)
Show SMILES NC(=N)NCCC[C@H](NC(=O)CN1CCN[C@H](Cc2ccccc2)C1=O)C(=O)c1nccs1
Show InChI InChI=1S/C22H29N7O3S/c23-22(24)27-8-4-7-16(19(31)20-26-10-12-33-20)28-18(30)14-29-11-9-25-17(21(29)32)13-15-5-2-1-3-6-15/h1-3,5-6,10,12,16-17,25H,4,7-9,11,13-14H2,(H,28,30)(H4,23,24,27)/t16-,17+/m0/s1
Reactome pathway
n/an/a 5.00E+3n/an/an/an/an/an/a
Millennium Pharmaceuticals Inc.
Curated by ChEMBL
Assay Description
In vitro inhibitory activity against factor Xa
Bioorg Med Chem Lett 13: 729-32 (2003)
BindingDB Entry DOI: 10.7270/Q2T72GTS
Prothrombin
(Homo sapiens (Human))
BDBM50125041
(2-((R)-3-Benzyl-2-oxo-piperazin-1-yl)-N-[(S)-4-gua...)
Show SMILES NC(=N)NCCC[C@H](NC(=O)CN1CCN[C@H](Cc2ccccc2)C1=O)C(=O)c1nccs1
Show InChI InChI=1S/C22H29N7O3S/c23-22(24)27-8-4-7-16(19(31)20-26-10-12-33-20)28-18(30)14-29-11-9-25-17(21(29)32)13-15-5-2-1-3-6-15/h1-3,5-6,10,12,16-17,25H,4,7-9,11,13-14H2,(H,28,30)(H4,23,24,27)/t16-,17+/m0/s1
n/an/a 2.20E+4n/an/an/an/an/an/a
Millennium Pharmaceuticals Inc.
Curated by ChEMBL
Assay Description
In vitro inhibitory activity against serine protease thrombin
Bioorg Med Chem Lett 13: 729-32 (2003)
BindingDB Entry DOI: 10.7270/Q2T72GTS