BDBM50125339 3-[2'-(3,4-Dimethyl-isoxazol-5-ylsulfamoyl)-2-methoxymethyl-biphenyl-4-ylmethyl]-5-ethyl-2-propyl-3H-imidazole-4-carboxylic acid amide::CHEMBL11840
SMILES: CCCc1nc(CC)c(C(N)=O)n1Cc1ccc(c(COC)c1)-c1ccccc1S(=O)(=O)Nc1onc(C)c1C
InChI Key: InChIKey=SOCAZRKGNBLYSF-UHFFFAOYSA-N
Data: 2 KI
Activity Spreadsheet -- Enzyme Inhibition Constant Data from BindingDB
Found 2 hits for monomerid = 50125339
Trg + Lig
Ki
nM
ΔG°
kcal/mole
IC50
nM
Kd
nM
EC50/IC50
nM
koff
s-1
kon
M-1s-1
pHTemp
°C
Angiotensin II receptor (AT-1) type-1
(RAT)
BDBM50125339
(3-[2'-(3,4-Dimethyl-isoxazol-5-ylsulfamoyl)-2-meth...)
Show SMILES CCCc1nc(CC)c(C(N)=O)n1Cc1ccc(c(COC)c1)-c1ccccc1S(=O)(=O)Nc1onc(C)c1C
Show InChI InChI=1S/C29H35N5O5S/c1-6-10-26-31-24(7-2)27(28(30)35)34(26)16-20-13-14-22(21(15-20)17-38-5)23-11-8-9-12-25(23)40(36,37)33-29-18(3)19(4)32-39-29/h8-9,11-15,33H,6-7,10,16-17H2,1-5H3,(H2,30,35)
0.600n/an/an/an/an/an/an/an/a
Bristol-Myers Squibb Pharmaceutical Research Institute
Curated by ChEMBL
Assay Description
Binding affinity towards Angiotensin II receptor, type 1 in rat aortic smooth muscle cells using 0.2 nM [125I]-labeled Sar-Ile-angiotensin II
Bioorg Med Chem Lett 13: 1093-6 (2003)
BindingDB Entry DOI: 10.7270/Q2NG4PZP
Endothelin-1 receptor
(Homo sapiens (Human))
BDBM50125339
(3-[2'-(3,4-Dimethyl-isoxazol-5-ylsulfamoyl)-2-meth...)
Show SMILES CCCc1nc(CC)c(C(N)=O)n1Cc1ccc(c(COC)c1)-c1ccccc1S(=O)(=O)Nc1onc(C)c1C
Show InChI InChI=1S/C29H35N5O5S/c1-6-10-26-31-24(7-2)27(28(30)35)34(26)16-20-13-14-22(21(15-20)17-38-5)23-11-8-9-12-25(23)40(36,37)33-29-18(3)19(4)32-39-29/h8-9,11-15,33H,6-7,10,16-17H2,1-5H3,(H2,30,35)
4n/an/an/an/an/an/an/an/a
Bristol-Myers Squibb Pharmaceutical Research Institute
Curated by ChEMBL
Assay Description
Binding affinity towards human ETA receptor expressed in CHO-K1 cells in the presence of 0.05 nM [125I]-labeled endothelin 1
Bioorg Med Chem Lett 13: 1093-6 (2003)
BindingDB Entry DOI: 10.7270/Q2NG4PZP