BDBM50125361 3-[2'-(3,4-Dimethyl-isoxazol-5-ylsulfamoyl)-2-methoxymethyl-biphenyl-4-ylmethyl]-5-ethyl-2-propyl-3H-imidazole-4-carboxylic acid methylamide::CHEMBL275545
SMILES: CCCc1nc(CC)c(C(=O)NC)n1Cc1ccc(c(COC)c1)-c1ccccc1S(=O)(=O)Nc1onc(C)c1C
InChI Key: InChIKey=MNJMLQKJRCXWRC-UHFFFAOYSA-N
Data: 2 KI
Activity Spreadsheet -- Enzyme Inhibition Constant Data from BindingDB
Found 2 hits for monomerid = 50125361
Trg + Lig
Ki
nM
ΔG°
kcal/mole
IC50
nM
Kd
nM
EC50/IC50
nM
koff
s-1
kon
M-1s-1
pHTemp
°C
Endothelin-1 receptor
(Homo sapiens (Human))
BDBM50125361
(3-[2'-(3,4-Dimethyl-isoxazol-5-ylsulfamoyl)-2-meth...)
Show SMILES CCCc1nc(CC)c(C(=O)NC)n1Cc1ccc(c(COC)c1)-c1ccccc1S(=O)(=O)Nc1onc(C)c1C
Show InChI InChI=1S/C30H37N5O5S/c1-7-11-27-32-25(8-2)28(29(36)31-5)35(27)17-21-14-15-23(22(16-21)18-39-6)24-12-9-10-13-26(24)41(37,38)34-30-19(3)20(4)33-40-30/h9-10,12-16,34H,7-8,11,17-18H2,1-6H3,(H,31,36)
7n/an/an/an/an/an/an/an/a
Bristol-Myers Squibb Pharmaceutical Research Institute
Curated by ChEMBL
Assay Description
Binding affinity towards human ETA receptor expressed in CHO-K1 cells in the presence of 0.05 nM [125I]-labeled endothelin 1
Bioorg Med Chem Lett 13: 1093-6 (2003)
BindingDB Entry DOI: 10.7270/Q2NG4PZP
Angiotensin II receptor (AT-1) type-1
(RAT)
BDBM50125361
(3-[2'-(3,4-Dimethyl-isoxazol-5-ylsulfamoyl)-2-meth...)
Show SMILES CCCc1nc(CC)c(C(=O)NC)n1Cc1ccc(c(COC)c1)-c1ccccc1S(=O)(=O)Nc1onc(C)c1C
Show InChI InChI=1S/C30H37N5O5S/c1-7-11-27-32-25(8-2)28(29(36)31-5)35(27)17-21-14-15-23(22(16-21)18-39-6)24-12-9-10-13-26(24)41(37,38)34-30-19(3)20(4)33-40-30/h9-10,12-16,34H,7-8,11,17-18H2,1-6H3,(H,31,36)
8n/an/an/an/an/an/an/an/a
Bristol-Myers Squibb Pharmaceutical Research Institute
Curated by ChEMBL
Assay Description
Binding affinity towards Angiotensin II receptor, type 1 in rat aortic smooth muscle cells using 0.2 nM [125I]-labeled Sar-Ile-angiotensin II
Bioorg Med Chem Lett 13: 1093-6 (2003)
BindingDB Entry DOI: 10.7270/Q2NG4PZP