BDBM50125996 (R)-2-[(S)-2-Amino-3-(2,6-dimethyl-phenyl)-propionylamino]-5-guanidino-pentanoic acid [(S)-1-(2-carbamoyl-ethylcarbamoyl)-2-phenyl-ethyl]-amide::CHEMBL280178
SMILES: Cc1cccc(C)c1C[C@H](N)C(=O)N[C@H](CCCNC(N)=N)C(=O)N[C@@H](Cc1ccccc1)C(=O)NCCC(N)=O
InChI Key: InChIKey=GKYITRXFIIFDSO-VXNXHJTFSA-N
Data: 2 KI  2 IC50
Activity Spreadsheet -- Enzyme Inhibition Constant Data from BindingDB
Found 4 hits for monomerid = 50125996
Trg + Lig
Ki
nM
ΔG°
kcal/mole
IC50
nM
Kd
nM
EC50/IC50
nM
koff
s-1
kon
M-1s-1
pHTemp
°C
Mu-type opioid receptor
(Rattus norvegicus (rat))
BDBM50125996
((R)-2-[(S)-2-Amino-3-(2,6-dimethyl-phenyl)-propion...)
Show SMILES Cc1cccc(C)c1C[C@H](N)C(=O)N[C@H](CCCNC(N)=N)C(=O)N[C@@H](Cc1ccccc1)C(=O)NCCC(N)=O
Show InChI InChI=1S/C29H42N8O4/c1-18-8-6-9-19(2)21(18)17-22(30)26(39)36-23(12-7-14-35-29(32)33)28(41)37-24(16-20-10-4-3-5-11-20)27(40)34-15-13-25(31)38/h3-6,8-11,22-24H,7,12-17,30H2,1-2H3,(H2,31,38)(H,34,40)(H,36,39)(H,37,41)(H4,32,33,35)/t22-,23+,24-/m0/s1
Reactome pathway
0.0623n/an/an/an/an/an/an/an/a
Tohoku Pharmaceutical University
Curated by ChEMBL
Assay Description
Ability of the compound to displace [3H]-DAMGO from mu opioid receptor
Bioorg Med Chem Lett 13: 1269-72 (2003)
BindingDB Entry DOI: 10.7270/Q2XS5TQ5
Opioid receptors; mu & delta
(Rattus norvegicus (rat))
BDBM50125996
((R)-2-[(S)-2-Amino-3-(2,6-dimethyl-phenyl)-propion...)
Show SMILES Cc1cccc(C)c1C[C@H](N)C(=O)N[C@H](CCCNC(N)=N)C(=O)N[C@@H](Cc1ccccc1)C(=O)NCCC(N)=O
Show InChI InChI=1S/C29H42N8O4/c1-18-8-6-9-19(2)21(18)17-22(30)26(39)36-23(12-7-14-35-29(32)33)28(41)37-24(16-20-10-4-3-5-11-20)27(40)34-15-13-25(31)38/h3-6,8-11,22-24H,7,12-17,30H2,1-2H3,(H2,31,38)(H,34,40)(H,36,39)(H,37,41)(H4,32,33,35)/t22-,23+,24-/m0/s1
Reactome pathway
2.57E+3n/an/an/an/an/an/an/an/a
Tohoku Pharmaceutical University
Curated by ChEMBL
Assay Description
Ability of the compound to displace [3H]-deltorphin II from delta opioid receptor
Bioorg Med Chem Lett 13: 1269-72 (2003)
BindingDB Entry DOI: 10.7270/Q2XS5TQ5
Delta-type opioid receptor
(MOUSE)
BDBM50125996
((R)-2-[(S)-2-Amino-3-(2,6-dimethyl-phenyl)-propion...)
Show SMILES Cc1cccc(C)c1C[C@H](N)C(=O)N[C@H](CCCNC(N)=N)C(=O)N[C@@H](Cc1ccccc1)C(=O)NCCC(N)=O
Show InChI InChI=1S/C29H42N8O4/c1-18-8-6-9-19(2)21(18)17-22(30)26(39)36-23(12-7-14-35-29(32)33)28(41)37-24(16-20-10-4-3-5-11-20)27(40)34-15-13-25(31)38/h3-6,8-11,22-24H,7,12-17,30H2,1-2H3,(H2,31,38)(H,34,40)(H,36,39)(H,37,41)(H4,32,33,35)/t22-,23+,24-/m0/s1
Reactome pathway
n/an/a 188n/an/an/an/an/an/a
Tohoku Pharmaceutical University
Curated by ChEMBL
Assay Description
Ability of the compound to inhibit electrically induced contractions of mouse vas deferens having delta opioid receptors tested in vitro
Bioorg Med Chem Lett 13: 1269-72 (2003)
BindingDB Entry DOI: 10.7270/Q2XS5TQ5
Mu-type opioid receptor
(GUINEA PIG)
BDBM50125996
((R)-2-[(S)-2-Amino-3-(2,6-dimethyl-phenyl)-propion...)
Show SMILES Cc1cccc(C)c1C[C@H](N)C(=O)N[C@H](CCCNC(N)=N)C(=O)N[C@@H](Cc1ccccc1)C(=O)NCCC(N)=O
Show InChI InChI=1S/C29H42N8O4/c1-18-8-6-9-19(2)21(18)17-22(30)26(39)36-23(12-7-14-35-29(32)33)28(41)37-24(16-20-10-4-3-5-11-20)27(40)34-15-13-25(31)38/h3-6,8-11,22-24H,7,12-17,30H2,1-2H3,(H2,31,38)(H,34,40)(H,36,39)(H,37,41)(H4,32,33,35)/t22-,23+,24-/m0/s1
n/an/a 9.90n/an/an/an/an/an/a
Tohoku Pharmaceutical University
Curated by ChEMBL
Assay Description
Ability of the compound to inhibit electrically induced contractions of guinea pig ileum having mu opioid receptors tested in vitro
Bioorg Med Chem Lett 13: 1269-72 (2003)
BindingDB Entry DOI: 10.7270/Q2XS5TQ5