BDBM50126044 5-[(4-Cyano-phenyl)-hydroxy-(3-methyl-3H-imidazol-4-yl)-methyl]-2'-methyl-biphenyl-2-carbonitrile::CHEMBL25621
SMILES: Cc1ccccc1-c1cc(ccc1C#N)C(O)(c1cncn1C)c1ccc(cc1)C#N
InChI Key: InChIKey=KKJPSAVOCOHZGT-UHFFFAOYSA-N
Data: 2 IC50  1 EC50
Activity Spreadsheet -- Enzyme Inhibition Constant Data from BindingDB
Found 3 hits for monomerid = 50126044
Trg + Lig
Ki
nM
ΔG°
kcal/mole
IC50
nM
Kd
nM
EC50/IC50
nM
koff
s-1
kon
M-1s-1
pHTemp
°C
Geranylgeranyl transferase type I
(Homo sapiens (Human))
BDBM50126044
(5-[(4-Cyano-phenyl)-hydroxy-(3-methyl-3H-imidazol-...)
Show SMILES Cc1ccccc1-c1cc(ccc1C#N)C(O)(c1cncn1C)c1ccc(cc1)C#N
Show InChI InChI=1S/C26H20N4O/c1-18-5-3-4-6-23(18)24-13-22(12-9-20(24)15-28)26(31,25-16-29-17-30(25)2)21-10-7-19(14-27)8-11-21/h3-13,16-17,31H,1-2H3
Reactome pathway
n/an/a 1.20E+3n/an/an/an/an/an/a
Abbott Laboratories
Curated by ChEMBL
Assay Description
Inhibition of human GGTase-catalyzed incorporation of [3H]-GGPP into biotinylated peptide of C-terminal of human K-Ras
Bioorg Med Chem Lett 13: 1293-6 (2003)
BindingDB Entry DOI: 10.7270/Q2DV1J8J
Protein Farnesyltransferase (PFT)
(Homo sapiens (Human))
BDBM50126044
(5-[(4-Cyano-phenyl)-hydroxy-(3-methyl-3H-imidazol-...)
Show SMILES Cc1ccccc1-c1cc(ccc1C#N)C(O)(c1cncn1C)c1ccc(cc1)C#N
Show InChI InChI=1S/C26H20N4O/c1-18-5-3-4-6-23(18)24-13-22(12-9-20(24)15-28)26(31,25-16-29-17-30(25)2)21-10-7-19(14-27)8-11-21/h3-13,16-17,31H,1-2H3
Reactome pathway
n/an/an/an/a<1n/an/an/an/a
Abbott Laboratories
Curated by ChEMBL
Assay Description
Inhibition of farnesylation in NIH-3T3H-ras cell line
Bioorg Med Chem Lett 13: 1293-6 (2003)
BindingDB Entry DOI: 10.7270/Q2DV1J8J
Protein Farnesyltransferase (PFT)
(Homo sapiens (Human))
BDBM50126044
(5-[(4-Cyano-phenyl)-hydroxy-(3-methyl-3H-imidazol-...)
Show SMILES Cc1ccccc1-c1cc(ccc1C#N)C(O)(c1cncn1C)c1ccc(cc1)C#N
Show InChI InChI=1S/C26H20N4O/c1-18-5-3-4-6-23(18)24-13-22(12-9-20(24)15-28)26(31,25-16-29-17-30(25)2)21-10-7-19(14-27)8-11-21/h3-13,16-17,31H,1-2H3
Reactome pathway
n/an/a 6n/an/an/an/an/an/a
Abbott Laboratories
Curated by ChEMBL
Assay Description
Inhibition of human FTase-catalyzed incorporation of [3H]-FPP into recombinant Ras CVIM
Bioorg Med Chem Lett 13: 1293-6 (2003)
BindingDB Entry DOI: 10.7270/Q2DV1J8J