BDBM50126151 CHEMBL3629574
SMILES: CC(C)Oc1ccc(CN2CCNCC2)cc1-n1c(CN2CCN(CC2)C(=O)COc2ccc(Cl)cc2)nc2ccccc2c1=O
InChI Key: InChIKey=XGKULGPEBBYKCA-UHFFFAOYSA-N
Data: 1 IC50
Activity Spreadsheet -- Enzyme Inhibition Constant Data from BindingDB
Found 1 hit for monomerid = 50126151
Trg + Lig
Ki
nM
ΔG°
kcal/mole
IC50
nM
Kd
nM
EC50/IC50
nM
koff
s-1
kon
M-1s-1
pHTemp
°C
Cystine/glutamate transporter
(Homo sapiens (Human))
BDBM50126151
(CHEMBL3629574)
Show SMILES CC(C)Oc1ccc(CN2CCNCC2)cc1-n1c(CN2CCN(CC2)C(=O)COc2ccc(Cl)cc2)nc2ccccc2c1=O |(1.61,6.02,;2.67,5.4,;3.74,6.01,;2.67,3.85,;4,3.08,;5.33,3.85,;6.67,3.07,;6.66,1.53,;8,.76,;9.33,1.54,;10.67,.77,;12,1.54,;12,3.08,;10.66,3.85,;9.33,3.08,;5.33,.77,;4,1.54,;2.66,.77,;2.66,-.77,;3.99,-1.54,;3.99,-3.08,;5.32,-3.86,;5.32,-5.4,;3.98,-6.16,;2.65,-5.39,;2.66,-3.85,;3.97,-7.7,;5.04,-8.32,;2.64,-8.47,;2.63,-10.01,;1.29,-10.77,;1.28,-12.31,;-.06,-13.07,;-1.39,-12.29,;-2.46,-12.9,;-1.38,-10.75,;-.04,-9.99,;1.33,-1.54,;,-.77,;-1.33,-1.54,;-2.68,-.77,;-2.68,.77,;-1.33,1.54,;,.77,;1.33,1.54,;1.33,2.77,)|
Show InChI InChI=1S/C35H41ClN6O4/c1-25(2)46-32-12-7-26(22-39-15-13-37-14-16-39)21-31(32)42-33(38-30-6-4-3-5-29(30)35(42)44)23-40-17-19-41(20-18-40)34(43)24-45-28-10-8-27(36)9-11-28/h3-12,21,25,37H,13-20,22-24H2,1-2H3
Reactome pathway
n/an/a 800n/an/an/an/an/an/a
Columbia University
Curated by ChEMBL
Assay Description
Inhibition of Xct in human CCF-STTG1 cells assessed as glutamate release after 2 hrs by fluorometry
Bioorg Med Chem Lett 25: 4787-92 (2015)
BindingDB Entry DOI: 10.7270/Q27H1MD5