BDBM50126440 CHEMBL30824::N-[7-(4-Dimethylamino-phenyl)-[1,6]naphthyridin-5-yl]-N'-methyl-propane-1,3-diamine
SMILES: CNCCCNc1nc(cc2ncccc12)-c1ccc(cc1)N(C)C
InChI Key: InChIKey=RSDAFWNUCMGWLJ-UHFFFAOYSA-N
Data: 3 IC50
Activity Spreadsheet -- Enzyme Inhibition Constant Data from BindingDB
Found 3 hits for monomerid = 50126440
Trg + Lig
Ki
nM
ΔG°
kcal/mole
IC50
nM
Kd
nM
EC50/IC50
nM
koff
s-1
kon
M-1s-1
pHTemp
°C
Tyrosine-protein kinase SYK
(Homo sapiens (Human))
BDBM50126440
(CHEMBL30824 | N-[7-(4-Dimethylamino-phenyl)-[1,6]n...)
Show SMILES CNCCCNc1nc(cc2ncccc12)-c1ccc(cc1)N(C)C
Show InChI InChI=1S/C20H25N5/c1-21-11-5-13-23-20-17-6-4-12-22-19(17)14-18(24-20)15-7-9-16(10-8-15)25(2)3/h4,6-10,12,14,21H,5,11,13H2,1-3H3,(H,23,24)
NCI pathway
Reactome pathway
n/an/a 78n/an/an/an/an/an/a
Boehringer Ingelheim Pharmaceuticals
Curated by ChEMBL
Assay Description
Inhibitory activity against spleen tyrosine kinase (SYK)
Bioorg Med Chem Lett 13: 1415-8 (2003)
BindingDB Entry DOI: 10.7270/Q2MC8ZCJ
Tyrosine-protein kinase SYK
(Homo sapiens (Human))
BDBM50126440
(CHEMBL30824 | N-[7-(4-Dimethylamino-phenyl)-[1,6]n...)
Show SMILES CNCCCNc1nc(cc2ncccc12)-c1ccc(cc1)N(C)C
Show InChI InChI=1S/C20H25N5/c1-21-11-5-13-23-20-17-6-4-12-22-19(17)14-18(24-20)15-7-9-16(10-8-15)25(2)3/h4,6-10,12,14,21H,5,11,13H2,1-3H3,(H,23,24)
NCI pathway
Reactome pathway
n/an/a 78n/an/an/an/an/an/a
Punjabi University
Curated by ChEMBL
Assay Description
Inhibition of spleen tyrosine kinase (unknown origin)
Eur J Med Chem 67: 434-46 (2013)
Article DOI: 10.1016/j.ejmech.2013.04.070
BindingDB Entry DOI: 10.7270/Q2Z039JB
Tyrosine-protein kinase SYK
(Homo sapiens (Human))
BDBM50126440
(CHEMBL30824 | N-[7-(4-Dimethylamino-phenyl)-[1,6]n...)
Show SMILES CNCCCNc1nc(cc2ncccc12)-c1ccc(cc1)N(C)C
Show InChI InChI=1S/C20H25N5/c1-21-11-5-13-23-20-17-6-4-12-22-19(17)14-18(24-20)15-7-9-16(10-8-15)25(2)3/h4,6-10,12,14,21H,5,11,13H2,1-3H3,(H,23,24)
NCI pathway
Reactome pathway
n/an/a 78n/an/an/an/an/an/a
Rigel, Inc.
Curated by ChEMBL
Assay Description
Inhibition of SYK
J Med Chem 55: 3614-43 (2012)
Article DOI: 10.1021/jm201271b
BindingDB Entry DOI: 10.7270/Q2NZ88RC