BDBM50126449 3-[(R)-3-((6R,12aR)-6-Benzo[1,3]dioxol-5-yl-1,4-dioxo-3,4,6,7,12,12a-hexahydro-1H-pyrazino[1',2':1,6]pyrido[3,4-b]indol-2-yl)-pyrrolidin-1-yl]-N,N-dimethyl-propionamide::CHEMBL33627
SMILES: CN(C)C(=O)CCN1CC[C@H](C1)N1CC(=O)N2[C@H](Cc3c([nH]c4ccccc34)[C@H]2c2ccc3OCOc3c2)C1=O
InChI Key: InChIKey=ZBBJEXJYASHZEV-XGBAOLAVSA-N
Data: 3 IC50
Activity Spreadsheet -- Enzyme Inhibition Constant Data from BindingDB
Found 3 hits for monomerid = 50126449
Trg + Lig
Ki
nM
ΔG°
kcal/mole
IC50
nM
Kd
nM
EC50/IC50
nM
koff
s-1
kon
M-1s-1
pHTemp
°C
Phosphodiesterase 11A
(Homo sapiens (Human))
BDBM50126449
(3-[(R)-3-((6R,12aR)-6-Benzo[1,3]dioxol-5-yl-1,4-di...)
Show SMILES CN(C)C(=O)CCN1CC[C@H](C1)N1CC(=O)N2[C@H](Cc3c([nH]c4ccccc34)[C@H]2c2ccc3OCOc3c2)C1=O
Show InChI InChI=1S/C30H33N5O5/c1-32(2)26(36)10-12-33-11-9-19(15-33)34-16-27(37)35-23(30(34)38)14-21-20-5-3-4-6-22(20)31-28(21)29(35)18-7-8-24-25(13-18)40-17-39-24/h3-8,13,19,23,29,31H,9-12,14-17H2,1-2H3/t19-,23-,29-/m1/s1
n/an/a 4.70n/an/an/an/an/an/a
Pfizer Global Research and Development
Curated by ChEMBL
Assay Description
Inhibitory activity against phosphodiesterase 11 (PDE11) obtained from recombinant Sf9 expression
Bioorg Med Chem Lett 13: 1425-8 (2003)
BindingDB Entry DOI: 10.7270/Q2GM86N6
Phosphodiesterase 6
(Homo sapiens (Human))
BDBM50126449
(3-[(R)-3-((6R,12aR)-6-Benzo[1,3]dioxol-5-yl-1,4-di...)
Show SMILES CN(C)C(=O)CCN1CC[C@H](C1)N1CC(=O)N2[C@H](Cc3c([nH]c4ccccc34)[C@H]2c2ccc3OCOc3c2)C1=O
Show InChI InChI=1S/C30H33N5O5/c1-32(2)26(36)10-12-33-11-9-19(15-33)34-16-27(37)35-23(30(34)38)14-21-20-5-3-4-6-22(20)31-28(21)29(35)18-7-8-24-25(13-18)40-17-39-24/h3-8,13,19,23,29,31H,9-12,14-17H2,1-2H3/t19-,23-,29-/m1/s1
n/an/a 807n/an/an/an/an/an/a
Pfizer Global Research and Development
Curated by ChEMBL
Assay Description
Inhibitory activity against phosphodiesterase 6 (PDE6) obtained from canine or bovine retina
Bioorg Med Chem Lett 13: 1425-8 (2003)
BindingDB Entry DOI: 10.7270/Q2GM86N6
cGMP-specific 3',5'-cyclic phosphodiesterase
(Homo sapiens (Human))
BDBM50126449
(3-[(R)-3-((6R,12aR)-6-Benzo[1,3]dioxol-5-yl-1,4-di...)
Show SMILES CN(C)C(=O)CCN1CC[C@H](C1)N1CC(=O)N2[C@H](Cc3c([nH]c4ccccc34)[C@H]2c2ccc3OCOc3c2)C1=O
Show InChI InChI=1S/C30H33N5O5/c1-32(2)26(36)10-12-33-11-9-19(15-33)34-16-27(37)35-23(30(34)38)14-21-20-5-3-4-6-22(20)31-28(21)29(35)18-7-8-24-25(13-18)40-17-39-24/h3-8,13,19,23,29,31H,9-12,14-17H2,1-2H3/t19-,23-,29-/m1/s1
Reactome pathway
n/an/a 2.5n/an/an/an/an/an/a
Pfizer Global Research and Development
Curated by ChEMBL
Assay Description
Inhibitory activity against phosphodiesterase 5 (PDE5) obtained from human corpus cavernosum tissue
Bioorg Med Chem Lett 13: 1425-8 (2003)
BindingDB Entry DOI: 10.7270/Q2GM86N6
3D
3D Structure (docked)