BDBM50126600 1,3-Dimethyl-4-{methyl-[4-(pyridin-4-yloxy)-benzenesulfonyl]-amino}-1H-pyrazolo[3,4-b]pyridine-5-carboxylic acid hydroxyamide::CHEMBL38180
SMILES: CN(c1c(cnc2n(C)nc(C)c12)C(=O)NO)S(=O)(=O)c1ccc(Oc2ccncc2)cc1
InChI Key: InChIKey=XQRSTZJAXGSSTI-UHFFFAOYSA-N
Data: 4 IC50
Activity Spreadsheet -- Enzyme Inhibition Constant Data from BindingDB
Found 4 hits for monomerid = 50126600
Trg + Lig
Ki
nM
ΔG°
kcal/mole
IC50
nM
Kd
nM
EC50/IC50
nM
koff
s-1
kon
M-1s-1
pHTemp
°C
Matrix metalloproteinase-9
(Homo sapiens (Human))
BDBM50126600
(1,3-Dimethyl-4-{methyl-[4-(pyridin-4-yloxy)-benzen...)
Show SMILES CN(c1c(cnc2n(C)nc(C)c12)C(=O)NO)S(=O)(=O)c1ccc(Oc2ccncc2)cc1
Show InChI InChI=1S/C21H20N6O5S/c1-13-18-19(17(21(28)25-29)12-23-20(18)26(2)24-13)27(3)33(30,31)16-6-4-14(5-7-16)32-15-8-10-22-11-9-15/h4-12,29H,1-3H3,(H,25,28)
Reactome pathway
n/an/a 2n/an/an/an/an/an/a
Wyeth-Ayerst Research
Curated by ChEMBL
Assay Description
Inhibitory activity against matrix metalloproteinase 9 (MMP-9).
Bioorg Med Chem Lett 13: 1487-90 (2003)
BindingDB Entry DOI: 10.7270/Q29W0DW0
Disintegrin and metalloproteinase domain-containing protein 17
(Homo sapiens (Human))
BDBM50126600
(1,3-Dimethyl-4-{methyl-[4-(pyridin-4-yloxy)-benzen...)
Show SMILES CN(c1c(cnc2n(C)nc(C)c12)C(=O)NO)S(=O)(=O)c1ccc(Oc2ccncc2)cc1
Show InChI InChI=1S/C21H20N6O5S/c1-13-18-19(17(21(28)25-29)12-23-20(18)26(2)24-13)27(3)33(30,31)16-6-4-14(5-7-16)32-15-8-10-22-11-9-15/h4-12,29H,1-3H3,(H,25,28)
Reactome pathway
n/an/a>100n/an/an/an/an/an/a
Wyeth-Ayerst Research
Curated by ChEMBL
Assay Description
Inhibitory activity against TACE.
Bioorg Med Chem Lett 13: 1487-90 (2003)
BindingDB Entry DOI: 10.7270/Q29W0DW0
Collagenase 3
(Homo sapiens (Human))
BDBM50126600
(1,3-Dimethyl-4-{methyl-[4-(pyridin-4-yloxy)-benzen...)
Show SMILES CN(c1c(cnc2n(C)nc(C)c12)C(=O)NO)S(=O)(=O)c1ccc(Oc2ccncc2)cc1
Show InChI InChI=1S/C21H20N6O5S/c1-13-18-19(17(21(28)25-29)12-23-20(18)26(2)24-13)27(3)33(30,31)16-6-4-14(5-7-16)32-15-8-10-22-11-9-15/h4-12,29H,1-3H3,(H,25,28)
NCI pathway
Reactome pathway
n/an/a 1n/an/an/an/an/an/a
Wyeth-Ayerst Research
Curated by ChEMBL
Assay Description
Inhibitory activity against matrix metalloproteinase 13 (MMP-13).
Bioorg Med Chem Lett 13: 1487-90 (2003)
BindingDB Entry DOI: 10.7270/Q29W0DW0
Interstitial collagenase
(Homo sapiens (Human))
BDBM50126600
(1,3-Dimethyl-4-{methyl-[4-(pyridin-4-yloxy)-benzen...)
Show SMILES CN(c1c(cnc2n(C)nc(C)c12)C(=O)NO)S(=O)(=O)c1ccc(Oc2ccncc2)cc1
Show InChI InChI=1S/C21H20N6O5S/c1-13-18-19(17(21(28)25-29)12-23-20(18)26(2)24-13)27(3)33(30,31)16-6-4-14(5-7-16)32-15-8-10-22-11-9-15/h4-12,29H,1-3H3,(H,25,28)
Reactome pathway
n/an/a 1.81E+3n/an/an/an/an/an/a
Wyeth-Ayerst Research
Curated by ChEMBL
Assay Description
Inhibitory activity against matrix metalloproteinase 1 (MMP-1).
Bioorg Med Chem Lett 13: 1487-90 (2003)
BindingDB Entry DOI: 10.7270/Q29W0DW0