BDBM50126748 2-(2,6-Dichloro-phenylamino)-1,6-dimethyl-7-vinyl-1,8-dihydro-imidazo[4,5-h]isoquinolin-9-one::CHEMBL26955
SMILES: Cc1c(C=C)[nH]c(=O)c2c3n(C)c(Nc4c(Cl)cccc4Cl)nc3ccc12
InChI Key: InChIKey=ZZUPKIUPVLXFKP-UHFFFAOYSA-N
Data: 1 IC50
Activity Spreadsheet -- Enzyme Inhibition Constant Data from BindingDB
Found 1 hit for monomerid = 50126748
Trg + Lig
Ki
nM
ΔG°
kcal/mole
IC50
nM
Kd
nM
EC50/IC50
nM
koff
s-1
kon
M-1s-1
pHTemp
°C
Tyrosine-protein kinase Lck
(Homo sapiens (Human))
BDBM50126748
(2-(2,6-Dichloro-phenylamino)-1,6-dimethyl-7-vinyl-...)
Show SMILES Cc1c(C=C)[nH]c(=O)c2c3n(C)c(Nc4c(Cl)cccc4Cl)nc3ccc12
Show InChI InChI=1S/C20H16Cl2N4O/c1-4-14-10(2)11-8-9-15-18(16(11)19(27)23-14)26(3)20(24-15)25-17-12(21)6-5-7-13(17)22/h4-9H,1H2,2-3H3,(H,23,27)(H,24,25)
n/an/a 45n/an/an/an/an/an/a
Boehringer Ingelheim Pharmaceuticals
Curated by ChEMBL
Assay Description
Inhibition of p56 Lck tyrosine kinase
J Med Chem 46: 1337-49 (2003)
Article DOI: 10.1021/jm020446l
BindingDB Entry DOI: 10.7270/Q2DN44FW