BDBM50126758 2-(2,6-Dichloro-phenylamino)-3,6,7-trimethyl-3,8-dihydro-imidazo[4,5-h]isoquinolin-9-one::CHEMBL29567
SMILES: Cc1[nH]c(=O)c2c3nc(Nc4c(Cl)cccc4Cl)n(C)c3ccc2c1C
InChI Key: InChIKey=CVOLWTFBGWEVNR-UHFFFAOYSA-N
Data: 1 IC50
Activity Spreadsheet -- Enzyme Inhibition Constant Data from BindingDB
Found 1 hit for monomerid = 50126758
Trg + Lig
Ki
nM
ΔG°
kcal/mole
IC50
nM
Kd
nM
EC50/IC50
nM
koff
s-1
kon
M-1s-1
pHTemp
°C
Tyrosine-protein kinase Lck
(Homo sapiens (Human))
BDBM50126758
(2-(2,6-Dichloro-phenylamino)-3,6,7-trimethyl-3,8-d...)
Show SMILES Cc1[nH]c(=O)c2c3nc(Nc4c(Cl)cccc4Cl)n(C)c3ccc2c1C
Show InChI InChI=1S/C19H16Cl2N4O/c1-9-10(2)22-18(26)15-11(9)7-8-14-17(15)24-19(25(14)3)23-16-12(20)5-4-6-13(16)21/h4-8H,1-3H3,(H,22,26)(H,23,24)
n/an/a>2.00E+3n/an/an/an/an/an/a
Boehringer Ingelheim Pharmaceuticals
Curated by ChEMBL
Assay Description
Inhibition of p56 Lck tyrosine kinase
J Med Chem 46: 1337-49 (2003)
Article DOI: 10.1021/jm020446l
BindingDB Entry DOI: 10.7270/Q2DN44FW