BDBM50126857 CHEMBL288003::Icosa-5,8,11,14-tetraenoic acid 2-thiophen-3-yl-ethyl ester
SMILES: CCCCC\C=C/C\C=C/C\C=C/C\C=C/CCCC(=O)OCCc1ccsc1
InChI Key: InChIKey=CHYTYNWDGNFICV-DOFZRALJSA-N
Data: 3 KI  1 IC50
Activity Spreadsheet -- Enzyme Inhibition Constant Data from BindingDB
Found 4 hits for monomerid = 50126857
Trg + Lig
Ki
nM
ΔG°
kcal/mole
IC50
nM
Kd
nM
EC50/IC50
nM
koff
s-1
kon
M-1s-1
pHTemp
°C
Cannabinoid receptor 1
(Rattus norvegicus (rat))
BDBM50126857
(CHEMBL288003 | Icosa-5,8,11,14-tetraenoic acid 2-t...)
Show SMILES CCCCC\C=C/C\C=C/C\C=C/C\C=C/CCCC(=O)OCCc1ccsc1
Show InChI InChI=1S/C26H38O2S/c1-2-3-4-5-6-7-8-9-10-11-12-13-14-15-16-17-18-19-26(27)28-22-20-25-21-23-29-24-25/h6-7,9-10,12-13,15-16,21,23-24H,2-5,8,11,14,17-20,22H2,1H3/b7-6-,10-9-,13-12-,16-15-
Reactome pathway
>1.00E+3n/an/an/an/an/an/an/an/a
Universidad Complutense
Curated by ChEMBL
Assay Description
Binding affinity against G protein coupled Cannabinoid receptor 1 using [3H]WIN-55212-2 in rat cerebellum membranes
J Med Chem 46: 1512-22 (2003)
Article DOI: 10.1021/jm0210818
BindingDB Entry DOI: 10.7270/Q2GQ6ZHS
Cannabinoid receptor 2
(Homo sapiens (Human))
BDBM50126857
(CHEMBL288003 | Icosa-5,8,11,14-tetraenoic acid 2-t...)
Show SMILES CCCCC\C=C/C\C=C/C\C=C/C\C=C/CCCC(=O)OCCc1ccsc1
Show InChI InChI=1S/C26H38O2S/c1-2-3-4-5-6-7-8-9-10-11-12-13-14-15-16-17-18-19-26(27)28-22-20-25-21-23-29-24-25/h6-7,9-10,12-13,15-16,21,23-24H,2-5,8,11,14,17-20,22H2,1H3/b7-6-,10-9-,13-12-,16-15-
Reactome pathway
>5.00E+3n/an/an/an/an/an/an/an/a
Universidad Complutense
Curated by ChEMBL
Assay Description
Binding affinity against G protein coupled human Cannabinoid receptor 2 using [3H]CP-55940 in HEK293 EBNA transfected cells
J Med Chem 46: 1512-22 (2003)
Article DOI: 10.1021/jm0210818
BindingDB Entry DOI: 10.7270/Q2GQ6ZHS
Vanilloid receptor
(Rattus norvegicus (rat))
BDBM50126857
(CHEMBL288003 | Icosa-5,8,11,14-tetraenoic acid 2-t...)
Show SMILES CCCCC\C=C/C\C=C/C\C=C/C\C=C/CCCC(=O)OCCc1ccsc1
Show InChI InChI=1S/C26H38O2S/c1-2-3-4-5-6-7-8-9-10-11-12-13-14-15-16-17-18-19-26(27)28-22-20-25-21-23-29-24-25/h6-7,9-10,12-13,15-16,21,23-24H,2-5,8,11,14,17-20,22H2,1H3/b7-6-,10-9-,13-12-,16-15-
Reactome pathway
>5.00E+3n/an/an/an/an/an/an/an/a
Universidad Complutense
Curated by ChEMBL
Assay Description
Binding affinity against vanilloid receptor 1 (VR1) using [3H]RTX in rat spinal cord membranes
J Med Chem 46: 1512-22 (2003)
Article DOI: 10.1021/jm0210818
BindingDB Entry DOI: 10.7270/Q2GQ6ZHS
Fatty-acid amide hydrolase 1 (aa 30-579)
(Rattus norvegicus (rat))
BDBM50126857
(CHEMBL288003 | Icosa-5,8,11,14-tetraenoic acid 2-t...)
Show SMILES CCCCC\C=C/C\C=C/C\C=C/C\C=C/CCCC(=O)OCCc1ccsc1
Show InChI InChI=1S/C26H38O2S/c1-2-3-4-5-6-7-8-9-10-11-12-13-14-15-16-17-18-19-26(27)28-22-20-25-21-23-29-24-25/h6-7,9-10,12-13,15-16,21,23-24H,2-5,8,11,14,17-20,22H2,1H3/b7-6-,10-9-,13-12-,16-15-
n/an/a 2.80E+4n/an/an/an/an/an/a
Universidad Complutense
Curated by ChEMBL
Assay Description
Inhibition of fatty acid amide hydrolase (FAAH) was determined using rat brain homogenates as the enzyme source and [3H]anandamide as substrate
J Med Chem 46: 1512-22 (2003)
Article DOI: 10.1021/jm0210818
BindingDB Entry DOI: 10.7270/Q2GQ6ZHS