BDBM50127002 CHEMBL3629595
SMILES: Oc1cccc(c1)C(=O)c1cc2ccc(O)cc2s1
InChI Key: InChIKey=USJHFRXDQKZINZ-UHFFFAOYSA-N
Data: 1 IC50
Activity Spreadsheet -- Enzyme Inhibition Constant Data from BindingDB
Found 1 hit for monomerid = 50127002
Trg + Lig
Ki
nM
ΔG°
kcal/mole
IC50
nM
Kd
nM
EC50/IC50
nM
koff
s-1
kon
M-1s-1
pHTemp
°C
Estradiol 17-beta-dehydrogenase 1 (17beta-HSD1)
(Homo sapiens (Human))
BDBM50127002
(CHEMBL3629595)
Show SMILES Oc1cccc(c1)C(=O)c1cc2ccc(O)cc2s1
Show InChI InChI=1S/C15H10O3S/c16-11-3-1-2-10(6-11)15(18)14-7-9-4-5-12(17)8-13(9)19-14/h1-8,16-17H
Reactome pathway
n/an/a 12n/an/an/an/an/an/a
Saarland University
Curated by ChEMBL
Assay Description
Inhibition of human placental cytosolic 17beta HSD1 using unlabeled- and labelled [2,4,6,7-3H]-E1 as substrate incubated for 10 mins by HPLC analysis
Eur J Med Chem 103: 56-68 (2015)
BindingDB Entry DOI: 10.7270/Q22V2HXX