BDBM50127025 CHEMBL3628253
SMILES: COc1ccc(cc1)-c1cnc2[nH]ccc2n1
InChI Key: InChIKey=RUZAAPFWOFOZCM-UHFFFAOYSA-N
Data: 1 IC50
Activity Spreadsheet -- Enzyme Inhibition Constant Data from BindingDB
Found 1 hit for monomerid = 50127025
Trg + Lig
Ki
nM
ΔG°
kcal/mole
IC50
nM
Kd
nM
EC50/IC50
nM
koff
s-1
kon
M-1s-1
pHTemp
°C
Mitogen-activated protein kinase 1
(Homo sapiens (Human))
BDBM50127025
(CHEMBL3628253)
Show SMILES COc1ccc(cc1)-c1cnc2[nH]ccc2n1
Show InChI InChI=1S/C13H11N3O/c1-17-10-4-2-9(3-5-10)12-8-15-13-11(16-12)6-7-14-13/h2-8H,1H3,(H,14,15)
NCI pathway
Reactome pathway
n/an/a 8.97E+4n/an/an/an/an/an/a
Genentech
Curated by ChEMBL
Assay Description
Inhibition of ERK2 (unknown origin) using 5FAM-IPTSPITTTYFFFKKK as substrate after 1 hr by LC3K assay
Bioorg Med Chem Lett 25: 4728-32 (2015)
BindingDB Entry DOI: 10.7270/Q2TB18QM