BDBM50127283 7-[(3-Chloro-phenyl)-imidazol-1-yl-methyl]-1-ethyl-2,3-dihydro-1H-indole::CHEMBL288695
SMILES: CCN1CCc2cccc(C(c3cccc(Cl)c3)n3ccnc3)c12
InChI Key: InChIKey=QRTIJMRHANZUDX-UHFFFAOYSA-N
Data: 1 IC50
Activity Spreadsheet -- Enzyme Inhibition Constant Data from BindingDB
Found 1 hit for monomerid = 50127283
Trg + Lig
Ki
nM
ΔG°
kcal/mole
IC50
nM
Kd
nM
EC50/IC50
nM
koff
s-1
kon
M-1s-1
pHTemp
°C
Cytochrome P450 19A1
(Homo sapiens (Human))
BDBM50127283
(7-[(3-Chloro-phenyl)-imidazol-1-yl-methyl]-1-ethyl...)
Show SMILES CCN1CCc2cccc(C(c3cccc(Cl)c3)n3ccnc3)c12
Show InChI InChI=1S/C20H20ClN3/c1-2-23-11-9-15-5-4-8-18(19(15)23)20(24-12-10-22-14-24)16-6-3-7-17(21)13-16/h3-8,10,12-14,20H,2,9,11H2,1H3
Reactome pathway
n/an/a 110n/an/an/an/an/an/a
UFR des Sciences Pharmaceutiques
Curated by ChEMBL
Assay Description
Inhibition of cytochrome P450 19A1 of human placental microsomes with [1beta,2beta-3H]testosterone
Bioorg Med Chem Lett 13: 1553-5 (2003)
BindingDB Entry DOI: 10.7270/Q2GH9HB7