BDBM50127951 (S)-3-(2-{5-Chloro-6-cyclopropyl-2-oxo-3-[(5,6,7,8-tetrahydro-[1,8]naphthyridin-2-ylmethyl)-amino]-2H-pyrazin-1-yl}-acetylamino)-3-quinolin-3-yl-propionic acid::CHEMBL301131
SMILES: OC(=O)C[C@H](NC(=O)Cn1c(C2CC2)c(Cl)nc(NCc2ccc3CCCNc3n2)c1=O)c1cnc2ccccc2c1
InChI Key: InChIKey=KZUKILQARHOBHB-QHCPKHFHSA-N
Data: 2 IC50
Activity Spreadsheet -- Enzyme Inhibition Constant Data from BindingDB
Found 2 hits for monomerid = 50127951
Trg + Lig
Ki
nM
ΔG°
kcal/mole
IC50
nM
Kd
nM
EC50/IC50
nM
koff
s-1
kon
M-1s-1
pHTemp
°C
ITGAV/ITGB3
(Homo sapiens (Human))
BDBM50127951
((S)-3-(2-{5-Chloro-6-cyclopropyl-2-oxo-3-[(5,6,7,8...)
Show SMILES OC(=O)C[C@H](NC(=O)Cn1c(C2CC2)c(Cl)nc(NCc2ccc3CCCNc3n2)c1=O)c1cnc2ccccc2c1
Show InChI InChI=1S/C30H30ClN7O4/c31-27-26(17-7-8-17)38(30(42)29(37-27)34-15-21-10-9-18-5-3-11-32-28(18)35-21)16-24(39)36-23(13-25(40)41)20-12-19-4-1-2-6-22(19)33-14-20/h1-2,4,6,9-10,12,14,17,23H,3,5,7-8,11,13,15-16H2,(H,32,35)(H,34,37)(H,36,39)(H,40,41)/t23-/m0/s1
n/an/a 0.700n/an/an/an/an/an/a
Merck Research Laboratories
Curated by ChEMBL
Assay Description
Inhibitory activity against human alpha V beta3 receptor using SPAV3 assay
Bioorg Med Chem Lett 13: 1809-12 (2003)
BindingDB Entry DOI: 10.7270/Q2CJ8CVB
Integrin alpha-IIb/beta-3
(Homo sapiens (Human))
BDBM50127951
((S)-3-(2-{5-Chloro-6-cyclopropyl-2-oxo-3-[(5,6,7,8...)
Show SMILES OC(=O)C[C@H](NC(=O)Cn1c(C2CC2)c(Cl)nc(NCc2ccc3CCCNc3n2)c1=O)c1cnc2ccccc2c1
Show InChI InChI=1S/C30H30ClN7O4/c31-27-26(17-7-8-17)38(30(42)29(37-27)34-15-21-10-9-18-5-3-11-32-28(18)35-21)16-24(39)36-23(13-25(40)41)20-12-19-4-1-2-6-22(19)33-14-20/h1-2,4,6,9-10,12,14,17,23H,3,5,7-8,11,13,15-16H2,(H,32,35)(H,34,37)(H,36,39)(H,40,41)/t23-/m0/s1
n/an/a>3.00E+3n/an/an/an/an/an/a
Merck Research Laboratories
Curated by ChEMBL
Assay Description
Ability to bind to the Alpha 2 Beta 3 integrin expressed as inhibitory concentration against ADP-stimulated aggregation of human gel-filtered platele...
Bioorg Med Chem Lett 13: 1809-12 (2003)
BindingDB Entry DOI: 10.7270/Q2CJ8CVB