BDBM50128071 (4-(4-(4,5-dihydrooxazol-2-yl)benzylidene)piperidin-1-yl)(4-chlorophenyl)methanone::(4-Chloro-phenyl)-{4-[4-(4,5-dihydro-oxazol-2-yl)-benzylidene]-piperidin-1-yl}-methanone::(4-chlorophenyl)(4-(4-(4,5-dihydrooxazol-2-yl)benzylidene)piperidin-1-yl)methanone::CHEMBL417571
SMILES: Clc1ccc(cc1)-[#6](=O)-[#7]-1-[#6]-[#6]\[#6](-[#6]-[#6]-1)=[#6]\c1ccc(cc1)-[#6]-1=[#7]-[#6]-[#6]-[#8]-1
InChI Key: InChIKey=JQNWPWUJMRAASQ-UHFFFAOYSA-N
Data: 5 IC50
Activity Spreadsheet -- Enzyme Inhibition Constant Data from BindingDB
Found 5 hits for monomerid = 50128071
Trg + Lig
Ki
nM
ΔG°
kcal/mole
IC50
nM
Kd
nM
EC50/IC50
nM
koff
s-1
kon
M-1s-1
pHTemp
°C
Lanosterol synthase
(Homo sapiens (Human))
BDBM50128071
((4-(4-(4,5-dihydrooxazol-2-yl)benzylidene)piperidi...)
Show SMILES Clc1ccc(cc1)-[#6](=O)-[#7]-1-[#6]-[#6]\[#6](-[#6]-[#6]-1)=[#6]\c1ccc(cc1)-[#6]-1=[#7]-[#6]-[#6]-[#8]-1 |t:25|
Show InChI InChI=1S/C22H21ClN2O2/c23-20-7-5-19(6-8-20)22(26)25-12-9-17(10-13-25)15-16-1-3-18(4-2-16)21-24-11-14-27-21/h1-8,15H,9-14H2
Reactome pathway
n/an/a 36n/an/an/an/an/an/a
Albert-Ludwigs-Universität
Curated by ChEMBL
Assay Description
Inhibitory activity against Oxidosqualene-lanosterol cyclase from human liver microsomes
J Med Chem 46: 2083-92 (2003)
Article DOI: 10.1021/jm0211218
BindingDB Entry DOI: 10.7270/Q2VM4BM9
Squalene-hopene cyclase
(Alicyclobacillus acidocaldarius)
BDBM50128071
((4-(4-(4,5-dihydrooxazol-2-yl)benzylidene)piperidi...)
Show SMILES Clc1ccc(cc1)-[#6](=O)-[#7]-1-[#6]-[#6]\[#6](-[#6]-[#6]-1)=[#6]\c1ccc(cc1)-[#6]-1=[#7]-[#6]-[#6]-[#8]-1 |t:25|
Show InChI InChI=1S/C22H21ClN2O2/c23-20-7-5-19(6-8-20)22(26)25-12-9-17(10-13-25)15-16-1-3-18(4-2-16)21-24-11-14-27-21/h1-8,15H,9-14H2
n/an/a 2.80E+3n/an/an/an/an/an/a
Albert-Ludwigs-Universität
Curated by ChEMBL
Assay Description
Inhibitory activity against squalene hopene cyclase from Alicyclobacillus acidocaldarius
J Med Chem 46: 2083-92 (2003)
Article DOI: 10.1021/jm0211218
BindingDB Entry DOI: 10.7270/Q2VM4BM9
Cycloartenol synthase
(Arabidopsis thaliana)
BDBM50128071
((4-(4-(4,5-dihydrooxazol-2-yl)benzylidene)piperidi...)
Show SMILES Clc1ccc(cc1)-[#6](=O)-[#7]-1-[#6]-[#6]\[#6](-[#6]-[#6]-1)=[#6]\c1ccc(cc1)-[#6]-1=[#7]-[#6]-[#6]-[#8]-1 |t:25|
Show InChI InChI=1S/C22H21ClN2O2/c23-20-7-5-19(6-8-20)22(26)25-12-9-17(10-13-25)15-16-1-3-18(4-2-16)21-24-11-14-27-21/h1-8,15H,9-14H2
Reactome pathway
n/an/a 2.50E+3n/an/an/an/an/an/a
Università di Torino
Curated by ChEMBL
Assay Description
Inhibition of Arabidopsis thaliana cycloartenol synthase expressed in Saccharomyces cerevisiae SMY8
Bioorg Med Chem Lett 19: 718-23 (2009)
Article DOI: 10.1016/j.bmcl.2008.12.040
BindingDB Entry DOI: 10.7270/Q2SF2W2N
Lanosterol synthase
(Homo sapiens (Human))
BDBM50128071
((4-(4-(4,5-dihydrooxazol-2-yl)benzylidene)piperidi...)
Show SMILES Clc1ccc(cc1)-[#6](=O)-[#7]-1-[#6]-[#6]\[#6](-[#6]-[#6]-1)=[#6]\c1ccc(cc1)-[#6]-1=[#7]-[#6]-[#6]-[#8]-1 |t:25|
Show InChI InChI=1S/C22H21ClN2O2/c23-20-7-5-19(6-8-20)22(26)25-12-9-17(10-13-25)15-16-1-3-18(4-2-16)21-24-11-14-27-21/h1-8,15H,9-14H2
Reactome pathway
n/an/a 1.15E+3n/an/an/an/an/an/a
Università di Torino
Curated by ChEMBL
Assay Description
Inhibition of human OSC expressed in Saccharomyces cerevisiae SMY8
Bioorg Med Chem Lett 19: 718-23 (2009)
Article DOI: 10.1016/j.bmcl.2008.12.040
BindingDB Entry DOI: 10.7270/Q2SF2W2N
Lanosterol synthase
(Saccharomyces cerevisiae)
BDBM50128071
((4-(4-(4,5-dihydrooxazol-2-yl)benzylidene)piperidi...)
Show SMILES Clc1ccc(cc1)-[#6](=O)-[#7]-1-[#6]-[#6]\[#6](-[#6]-[#6]-1)=[#6]\c1ccc(cc1)-[#6]-1=[#7]-[#6]-[#6]-[#8]-1 |t:25|
Show InChI InChI=1S/C22H21ClN2O2/c23-20-7-5-19(6-8-20)22(26)25-12-9-17(10-13-25)15-16-1-3-18(4-2-16)21-24-11-14-27-21/h1-8,15H,9-14H2
Reactome pathway
n/an/a 670n/an/an/an/an/an/a
Università di Torino
Curated by ChEMBL
Assay Description
Inhibition of yeast OSC expressed in Saccharomyces cerevisiae SMY8
Bioorg Med Chem Lett 19: 718-23 (2009)
Article DOI: 10.1016/j.bmcl.2008.12.040
BindingDB Entry DOI: 10.7270/Q2SF2W2N