BDBM50128111 1-((2E,4E)-5-Benzo[1,3]dioxol-5-yl-penta-2,4-dienyl)-piperidine::1-(5-(benzo[d][1,3]dioxol-5-yl)penta-2,4-dienyl)piperidine::1-(5-Benzo[1,3]dioxol-5-yl-penta-2,4-dienyl)-piperidine::CHEMBL418484
SMILES: C(\C=C\C=C\c1ccc2OCOc2c1)N1CCCCC1
InChI Key: InChIKey=WSPMSRHCKZFXOA-YYPVUZKKSA-N
Data: 1 KI  2 IC50
Activity Spreadsheet -- Enzyme Inhibition Constant Data from BindingDB
Found 3 hits for monomerid = 50128111
Trg + Lig
Ki
nM
ΔG°
kcal/mole
IC50
nM
Kd
nM
EC50/IC50
nM
koff
s-1
kon
M-1s-1
pHTemp
°C
Sigma non-opioid intracellular receptor 1
(Homo sapiens (Human))
BDBM50128111
(1-((2E,4E)-5-Benzo[1,3]dioxol-5-yl-penta-2,4-dieny...)
Show SMILES C(\C=C\C=C\c1ccc2OCOc2c1)N1CCCCC1
Show InChI InChI=1S/C17H21NO2/c1(4-10-18-11-5-2-6-12-18)3-7-15-8-9-16-17(13-15)20-14-19-16/h1,3-4,7-9,13H,2,5-6,10-12,14H2/b4-1+,7-3+
0.860n/an/an/an/an/an/an/an/a
Universit£ di Bari
Curated by ChEMBL
Assay Description
Inhibition of [3H]pentazocine binding to Sigma receptor type 1 in guinea pig brain membrane without cerebellum
J Med Chem 46: 2117-24 (2003)
Article DOI: 10.1021/jm021014d
BindingDB Entry DOI: 10.7270/Q2DF6RZR
Monoamine Oxidase Type B (MAO-B)
(Rattus norvegicus (rat))
BDBM50128111
(1-((2E,4E)-5-Benzo[1,3]dioxol-5-yl-penta-2,4-dieny...)
Show SMILES C(\C=C\C=C\c1ccc2OCOc2c1)N1CCCCC1
Show InChI InChI=1S/C17H21NO2/c1(4-10-18-11-5-2-6-12-18)3-7-15-8-9-16-17(13-15)20-14-19-16/h1,3-4,7-9,13H,2,5-6,10-12,14H2/b4-1+,7-3+
n/an/a>1.00E+5n/an/an/an/an/an/a
General Hospital of PLA
Curated by ChEMBL
Assay Description
Inhibition of MAO-B in Sprague-Dawley rat brain homogenate using kynuramine as substrate preincubated for 10 mins measured by fluorimetric assay
Bioorg Med Chem Lett 22: 3343-8 (2012)
Article DOI: 10.1016/j.bmcl.2012.02.090
BindingDB Entry DOI: 10.7270/Q2JW8FWM
Monoamine oxidase
(Rattus norvegicus (rat))
BDBM50128111
(1-((2E,4E)-5-Benzo[1,3]dioxol-5-yl-penta-2,4-dieny...)
Show SMILES C(\C=C\C=C\c1ccc2OCOc2c1)N1CCCCC1
Show InChI InChI=1S/C17H21NO2/c1(4-10-18-11-5-2-6-12-18)3-7-15-8-9-16-17(13-15)20-14-19-16/h1,3-4,7-9,13H,2,5-6,10-12,14H2/b4-1+,7-3+
n/an/a>1.00E+5n/an/an/an/an/an/a
General Hospital of PLA
Curated by ChEMBL
Assay Description
Inhibition of MAO-A in Sprague-Dawley rat brain homogenate using kynuramine as substrate preincubated for 10 mins measured by fluorimetric assay
Bioorg Med Chem Lett 22: 3343-8 (2012)
Article DOI: 10.1016/j.bmcl.2012.02.090
BindingDB Entry DOI: 10.7270/Q2JW8FWM