BDBM50128148 1,1,1-Trifluoro-3-{[3-(3-fluoro-2-nitro-phenoxy)-phenyl]-[3-(1,1,2,2-tetrafluoro-ethoxy)-benzyl]-amino}-propan-2-ol::1,1,1-trifluoro-3-((3-(3-fluoro-2-nitrophenoxy)phenyl)(3-(1,1,2,2-tetrafluoroethoxy)benzyl)amino)propan-2-ol::3-((3-(1,1,2,2-tetrafluoroethoxy)benzyl)(3-(3-fluoro-2-nitrophenoxy)phenyl)amino)-1,1,1-trifluoropropan-2-ol::CHEMBL305995
SMILES: OC(CN(Cc1cccc(OC(F)(F)C(F)F)c1)c1cccc(Oc2cccc(F)c2[N+]([O-])=O)c1)C(F)(F)F
InChI Key: InChIKey=XWNQFZQZCQGEMG-UHFFFAOYSA-N
Data: 5 IC50
Activity Spreadsheet -- Enzyme Inhibition Constant Data from BindingDB
Found 5 hits for monomerid = 50128148
Trg + Lig
Ki
nM
ΔG°
kcal/mole
IC50
nM
Kd
nM
EC50/IC50
nM
koff
s-1
kon
M-1s-1
pHTemp
°C
Cholesteryl ester transfer protein
(Homo sapiens (Human))
BDBM50128148
(1,1,1-Trifluoro-3-{[3-(3-fluoro-2-nitro-phenoxy)-p...)
Show SMILES OC(CN(Cc1cccc(OC(F)(F)C(F)F)c1)c1cccc(Oc2cccc(F)c2[N+]([O-])=O)c1)C(F)(F)F
Show InChI InChI=1S/C24H18F8N2O5/c25-18-8-3-9-19(21(18)34(36)37)38-16-6-2-5-15(11-16)33(13-20(35)23(28,29)30)12-14-4-1-7-17(10-14)39-24(31,32)22(26)27/h1-11,20,22,35H,12-13H2
Reactome pathway
n/an/a 5.60E+3n/an/an/an/an/an/a
Pharmacia Discovery Research (Pfizer Global Research and Development)
Curated by ChEMBL
Assay Description
Compound was tested in vitro for inhibitory activity against recombinant human cholesteryl ester transfer protein in human serum
J Med Chem 46: 2152-68 (2003)
Article DOI: 10.1021/jm020528+
BindingDB Entry DOI: 10.7270/Q2QV3KWK
Cholesteryl ester transfer protein
(Homo sapiens (Human))
BDBM50128148
(1,1,1-Trifluoro-3-{[3-(3-fluoro-2-nitro-phenoxy)-p...)
Show SMILES OC(CN(Cc1cccc(OC(F)(F)C(F)F)c1)c1cccc(Oc2cccc(F)c2[N+]([O-])=O)c1)C(F)(F)F
Show InChI InChI=1S/C24H18F8N2O5/c25-18-8-3-9-19(21(18)34(36)37)38-16-6-2-5-15(11-16)33(13-20(35)23(28,29)30)12-14-4-1-7-17(10-14)39-24(31,32)22(26)27/h1-11,20,22,35H,12-13H2
Reactome pathway
n/an/a 100n/an/an/an/an/an/a
Pharmacia Discovery Research (Pfizer Global Research and Development)
Curated by ChEMBL
Assay Description
Compound was tested in vitro for inhibitory activity against recombinant human cholesteryl ester transfer protein in buffer
J Med Chem 46: 2152-68 (2003)
Article DOI: 10.1021/jm020528+
BindingDB Entry DOI: 10.7270/Q2QV3KWK
Cholesteryl ester transfer protein
(Homo sapiens (Human))
BDBM50128148
(1,1,1-Trifluoro-3-{[3-(3-fluoro-2-nitro-phenoxy)-p...)
Show SMILES OC(CN(Cc1cccc(OC(F)(F)C(F)F)c1)c1cccc(Oc2cccc(F)c2[N+]([O-])=O)c1)C(F)(F)F
Show InChI InChI=1S/C24H18F8N2O5/c25-18-8-3-9-19(21(18)34(36)37)38-16-6-2-5-15(11-16)33(13-20(35)23(28,29)30)12-14-4-1-7-17(10-14)39-24(31,32)22(26)27/h1-11,20,22,35H,12-13H2
Reactome pathway
n/an/a 1.00E+5n/an/an/an/an/an/a
TBA
Assay Description
Inhibition of CETP (unknown origin)-mediated [3H]cholesteryl ester transfer from HDL donor particles to LDL acceptor particles
Citation and Details
Article DOI: 10.1007/s00044-004-0104-9
BindingDB Entry DOI: 10.7270/Q2SQ9387
Cholesteryl ester transfer protein
(Oryctolagus cuniculus)
BDBM50128148
(1,1,1-Trifluoro-3-{[3-(3-fluoro-2-nitro-phenoxy)-p...)
Show SMILES OC(CN(Cc1cccc(OC(F)(F)C(F)F)c1)c1cccc(Oc2cccc(F)c2[N+]([O-])=O)c1)C(F)(F)F
Show InChI InChI=1S/C24H18F8N2O5/c25-18-8-3-9-19(21(18)34(36)37)38-16-6-2-5-15(11-16)33(13-20(35)23(28,29)30)12-14-4-1-7-17(10-14)39-24(31,32)22(26)27/h1-11,20,22,35H,12-13H2
n/an/a 100n/an/an/an/an/an/a
Al-Zaytoonah Private University of Jordan
Curated by ChEMBL
Assay Description
Inhibition of CETP in rabbit serum after 1 hr by fluorescent cholesteryl esters transfer assay
Eur J Med Chem 45: 1598-617 (2010)
Article DOI: 10.1016/j.ejmech.2009.12.070
BindingDB Entry DOI: 10.7270/Q2VQ32VS
Cholesteryl ester transfer protein
(Homo sapiens (Human))
BDBM50128148
(1,1,1-Trifluoro-3-{[3-(3-fluoro-2-nitro-phenoxy)-p...)
Show SMILES OC(CN(Cc1cccc(OC(F)(F)C(F)F)c1)c1cccc(Oc2cccc(F)c2[N+]([O-])=O)c1)C(F)(F)F
Show InChI InChI=1S/C24H18F8N2O5/c25-18-8-3-9-19(21(18)34(36)37)38-16-6-2-5-15(11-16)33(13-20(35)23(28,29)30)12-14-4-1-7-17(10-14)39-24(31,32)22(26)27/h1-11,20,22,35H,12-13H2
Reactome pathway
n/an/a 100n/an/an/an/an/an/a
Universidade Federal da Bahia
Curated by ChEMBL
Assay Description
Inhibition of CETP
Bioorg Med Chem 15: 6242-52 (2007)
Article DOI: 10.1016/j.bmc.2007.06.021
BindingDB Entry DOI: 10.7270/Q2B857VG