BDBM50128184 3-((3-(1,1,2,2-tetrafluoroethoxy)benzyl)(3-(3-(dimethylamino)phenoxy)phenyl)amino)-1,1,1-trifluoropropan-2-ol::3-((3-(3-(dimethylamino)phenoxy)phenyl)(3-(1,1,2,2-tetrafluoroethoxy)benzyl)amino)-1,1,1-trifluoropropan-2-ol::3-{[3-(3-Dimethylamino-phenoxy)-phenyl]-[3-(1,1,2,2-tetrafluoro-ethoxy)-benzyl]-amino}-1,1,1-trifluoro-propan-2-ol::CHEMBL305003
SMILES: CN(C)c1cccc(Oc2cccc(c2)N(CC(O)C(F)(F)F)Cc2cccc(OC(F)(F)C(F)F)c2)c1
InChI Key: InChIKey=NOVSYOAFPGEWMY-UHFFFAOYSA-N
Data: 4 IC50
Activity Spreadsheet -- Enzyme Inhibition Constant Data from BindingDB
Found 4 hits for monomerid = 50128184
Trg + Lig
Ki
nM
ΔG°
kcal/mole
IC50
nM
Kd
nM
EC50/IC50
nM
koff
s-1
kon
M-1s-1
pHTemp
°C
Cholesteryl ester transfer protein
(Homo sapiens (Human))
BDBM50128184
(3-((3-(1,1,2,2-tetrafluoroethoxy)benzyl)(3-(3-(dim...)
Show SMILES CN(C)c1cccc(Oc2cccc(c2)N(CC(O)C(F)(F)F)Cc2cccc(OC(F)(F)C(F)F)c2)c1
Show InChI InChI=1S/C26H25F7N2O3/c1-34(2)18-7-4-9-20(13-18)37-21-10-5-8-19(14-21)35(16-23(36)25(29,30)31)15-17-6-3-11-22(12-17)38-26(32,33)24(27)28/h3-14,23-24,36H,15-16H2,1-2H3
Reactome pathway
n/an/a 200n/an/an/an/an/an/a
Pharmacia Discovery Research (Pfizer Global Research and Development)
Curated by ChEMBL
Assay Description
Compound was tested in vitro for inhibitory activity against recombinant human cholesteryl ester transfer protein in buffer
J Med Chem 46: 2152-68 (2003)
Article DOI: 10.1021/jm020528+
BindingDB Entry DOI: 10.7270/Q2QV3KWK
Cholesteryl ester transfer protein
(Homo sapiens (Human))
BDBM50128184
(3-((3-(1,1,2,2-tetrafluoroethoxy)benzyl)(3-(3-(dim...)
Show SMILES CN(C)c1cccc(Oc2cccc(c2)N(CC(O)C(F)(F)F)Cc2cccc(OC(F)(F)C(F)F)c2)c1
Show InChI InChI=1S/C26H25F7N2O3/c1-34(2)18-7-4-9-20(13-18)37-21-10-5-8-19(14-21)35(16-23(36)25(29,30)31)15-17-6-3-11-22(12-17)38-26(32,33)24(27)28/h3-14,23-24,36H,15-16H2,1-2H3
Reactome pathway
n/an/a 2.00E+5n/an/an/an/an/an/a
TBA
Assay Description
Inhibition of CETP (unknown origin)-mediated [3H]cholesteryl ester transfer from HDL donor particles to LDL acceptor particles
Citation and Details
Article DOI: 10.1007/s00044-004-0104-9
BindingDB Entry DOI: 10.7270/Q2SQ9387
Cholesteryl ester transfer protein
(Oryctolagus cuniculus)
BDBM50128184
(3-((3-(1,1,2,2-tetrafluoroethoxy)benzyl)(3-(3-(dim...)
Show SMILES CN(C)c1cccc(Oc2cccc(c2)N(CC(O)C(F)(F)F)Cc2cccc(OC(F)(F)C(F)F)c2)c1
Show InChI InChI=1S/C26H25F7N2O3/c1-34(2)18-7-4-9-20(13-18)37-21-10-5-8-19(14-21)35(16-23(36)25(29,30)31)15-17-6-3-11-22(12-17)38-26(32,33)24(27)28/h3-14,23-24,36H,15-16H2,1-2H3
n/an/a 200n/an/an/an/an/an/a
Al-Zaytoonah Private University of Jordan
Curated by ChEMBL
Assay Description
Inhibition of CETP in rabbit serum after 1 hr by fluorescent cholesteryl esters transfer assay
Eur J Med Chem 45: 1598-617 (2010)
Article DOI: 10.1016/j.ejmech.2009.12.070
BindingDB Entry DOI: 10.7270/Q2VQ32VS
Cholesteryl ester transfer protein
(Homo sapiens (Human))
BDBM50128184
(3-((3-(1,1,2,2-tetrafluoroethoxy)benzyl)(3-(3-(dim...)
Show SMILES CN(C)c1cccc(Oc2cccc(c2)N(CC(O)C(F)(F)F)Cc2cccc(OC(F)(F)C(F)F)c2)c1
Show InChI InChI=1S/C26H25F7N2O3/c1-34(2)18-7-4-9-20(13-18)37-21-10-5-8-19(14-21)35(16-23(36)25(29,30)31)15-17-6-3-11-22(12-17)38-26(32,33)24(27)28/h3-14,23-24,36H,15-16H2,1-2H3
Reactome pathway
n/an/a 200n/an/an/an/an/an/a
Universidade Federal da Bahia
Curated by ChEMBL
Assay Description
Inhibition of CETP
Bioorg Med Chem 15: 6242-52 (2007)
Article DOI: 10.1016/j.bmc.2007.06.021
BindingDB Entry DOI: 10.7270/Q2B857VG