BDBM50128394 2-(4-Hydroxy-phenyl)-1-[4-(2-pyrrolidin-1-yl-ethoxy)-benzyl]-1,2,3,4-tetrahydro-quinolin-6-ol::CHEMBL56306
SMILES: Oc1ccc(cc1)C1CCc2cc(O)ccc2N1Cc1ccc(OCCN2CCCC2)cc1
InChI Key: InChIKey=GDUBWKFFFZPKRD-UHFFFAOYSA-N
Data: 2 KI  1 IC50
Activity Spreadsheet -- Enzyme Inhibition Constant Data from BindingDB
Found 3 hits for monomerid = 50128394
Trg + Lig
Ki
nM
ΔG°
kcal/mole
IC50
nM
Kd
nM
EC50/IC50
nM
koff
s-1
kon
M-1s-1
pHTemp
°C
Estrogen receptor
(Homo sapiens (Human))
BDBM50128394
(2-(4-Hydroxy-phenyl)-1-[4-(2-pyrrolidin-1-yl-ethox...)
Show SMILES Oc1ccc(cc1)C1CCc2cc(O)ccc2N1Cc1ccc(OCCN2CCCC2)cc1
Show InChI InChI=1S/C28H32N2O3/c31-24-8-5-22(6-9-24)27-13-7-23-19-25(32)10-14-28(23)30(27)20-21-3-11-26(12-4-21)33-18-17-29-15-1-2-16-29/h3-6,8-12,14,19,27,31-32H,1-2,7,13,15-18,20H2
1.10n/an/an/an/an/an/an/an/a
Lilly Research Laboratories
Curated by ChEMBL
Assay Description
Binding affinity for estrogen receptor alpha
Bioorg Med Chem Lett 13: 1907-10 (2003)
BindingDB Entry DOI: 10.7270/Q2K35T16
Estradiol receptor beta (ERβ)
(Homo sapiens (Human))
BDBM50128394
(2-(4-Hydroxy-phenyl)-1-[4-(2-pyrrolidin-1-yl-ethox...)
Show SMILES Oc1ccc(cc1)C1CCc2cc(O)ccc2N1Cc1ccc(OCCN2CCCC2)cc1
Show InChI InChI=1S/C28H32N2O3/c31-24-8-5-22(6-9-24)27-13-7-23-19-25(32)10-14-28(23)30(27)20-21-3-11-26(12-4-21)33-18-17-29-15-1-2-16-29/h3-6,8-12,14,19,27,31-32H,1-2,7,13,15-18,20H2
4.90n/an/an/an/an/an/an/an/a
Lilly Research Laboratories
Curated by ChEMBL
Assay Description
Binding affinity for estrogen receptor beta
Bioorg Med Chem Lett 13: 1907-10 (2003)
BindingDB Entry DOI: 10.7270/Q2K35T16
Estrogen receptor
(Homo sapiens (Human))
BDBM50128394
(2-(4-Hydroxy-phenyl)-1-[4-(2-pyrrolidin-1-yl-ethox...)
Show SMILES Oc1ccc(cc1)C1CCc2cc(O)ccc2N1Cc1ccc(OCCN2CCCC2)cc1
Show InChI InChI=1S/C28H32N2O3/c31-24-8-5-22(6-9-24)27-13-7-23-19-25(32)10-14-28(23)30(27)20-21-3-11-26(12-4-21)33-18-17-29-15-1-2-16-29/h3-6,8-12,14,19,27,31-32H,1-2,7,13,15-18,20H2
n/an/a 68n/an/an/an/an/an/a
Lilly Research Laboratories
Curated by ChEMBL
Assay Description
Inhibition of estradiol-stimulated MCF-7 breast adenocarcinoma cell proliferation
Bioorg Med Chem Lett 13: 1907-10 (2003)
BindingDB Entry DOI: 10.7270/Q2K35T16